{"text_format":"1","workbook":"xlsx","n_sheets":27,"sheets":["記載要領","第1号","第1号 第二面","第2号 (助成対象事業者用)","第2号 (共同申請者①用) ","第2号 (共同申請者②用) ","第2号 (共同申請者③用) ","第2号 (手続き代行者用)","第3号","第4号.バイオマス発電","第4号.バイオマス発電設備の概要_１枚目","別紙１(1)","別紙１(2)","第4号.バイオマス発電設備の概要_２枚目 ","別紙１(1)_２枚目 ","別紙１(2)_２枚目 ","第4号.バイオマス発電設備の概要_３枚目","別紙１(1)_３枚目","別紙１(2)_３枚目","第4号.バイオマス発電設備の概要_４枚目","別紙１(1)_４枚目","別紙１(2)_４枚目","第4号.バイオマス発電設備の概要_５枚目","別紙１_５枚目","別紙１ (2)_５枚目","第4号.バイオマス発電_導入効果","第4号.バイオマス発電_4ー10"],"not_rendered":{"charts":0,"images":2,"macros":0,"external_links":3,"defined_names":37,"comments":0,"pivot_tables":0},"unopened":[],"bounds":{"document_bytes":16777216,"sheet_cells":100000,"rows_first":2000,"rows_last":500,"rows_between":2000,"halvings":0,"cell_chars":16384,"cell_head_chars":4096},"cells_cut":0,"cells_raw":0,"read":"whole","date_system":"1900"}

{"sheet":"記載要領","index":0,"n_rows":61,"n_cols":10,"rows_kept":61,"cut":false,"hidden":false,"merged":[[53,3,53,26],[57,3,57,26],[1,1,1,27],[58,3,58,26],[20,3,20,26],[45,1,45,27],[49,3,49,26],[54,3,54,26],[33,3,33,26],[34,3,34,26],[21,3,21,26]]}
[]
[null,"再エネ設備の新規導入につながる電力調達構築事業助成金\n申請関係様式の記入要領"]
[]
[null,"１．本エクセルで作成する個別様式"]
[null,null,"・第１号様式",null,null,null,null,null,"：","助成金交付申請書"]
[null,null,"・第２号様式",null,null,null,null,null,"：","誓約書"]
[null,null,"・第３号様式",null,null,null,null,null,"：","助成対象事業の実施に係る同意書"]
[null,null,"・第４号様式",null,null,null,null,null,"：","事業実施計画書（※設備ごとに様式が異なります。該当する様式を使用してください。）"]
[null,null,"・第４号様式：別紙１",null,null,null,null,null,"：","バイオマス依存率計算書（バイオマス発電）"]
[null,null,"・第４号様式：別紙１（2）",null,null,null,null,null,"：","バイオマス依存率計算書（バイオマス燃料製造）"]
[]
[null,"２．入力の流れ"]
[]
[]
[]
[]
[null,null,null,null,null,null,null,null,null,"シートの列んでいる順番に入力していく"]
[]
[null,"３．入力の手順"]
[null,null,"（１）「基本情報」入力シートへの入力"]
[null,null,null,"　「基本情報」入力シートに、入力可能な情報を入力してください。"]
[null,null,null,"　（重複する入力等の省力化ができます。）"]
[]
[null,null,null,null,null,"セルの色が黄色い部分に入力してください。　"]
[]
[null,null,null,null,null,"セルの色が水色の部分は自動計算、又はリンク自動表示されています。入力は不要です。"]
[]
[null,null,null,null,null,"セルの色がピンク色の部分は、プルダウンリストから選択してください。"]
[]
[null,null,null,null,null,"セルが着色されていない部分は、全て保護が掛かっていますので、入力はできません。"]
[]
[]
[null,null,"（２）個別様式への入力"]
[null,null,null,"上述の「基本情報」入力シートへ入力した情報で、個別の様式にリンク可能な情報はリンク自動表示されます。"]
[null,null,null,"入力するセルの色使いは「基本情報」入力シートと同じです。"]
[]
[null,null,null,null,null,"セルの色が黄色い部分に入力してください。　"]
[]
[null,null,null,null,null,"セルの色が水色の部分は自動計算、又はリンク自動表示されています。入力は不要です。"]
[]
[null,null,null,null,null,"セルの色がピンク色の部分は、プルダウンリストから選択してください。"]
[]
[null,null,null,null,null,"セルが着色されていない部分は、全て保護が掛かっていますので、入力はできません。"]
[]
[]
[null,"再エネ設備の新規導入につながる電力調達構築事業助成金\n申請関係様式の記入要領"]
[]
[]
[null,"１．申請する各様式の印刷について"]
[null,null,null,"各様式を印刷するにあたっては、セルの色を印刷しないようお願い致します。"]
[]
[]
[null,"２．設定方法"]
[null,null,null,"※本ファイルは、セルの色を印刷しないよう設定しています。"]
[null,null,null,"　もし、設定が解除されておりましたら、下記の手順を基に設定してください。"]
[]
[null,null,"【印刷設定の手順】"]
[null,null,null,"①「ファイル」メニューの「ページ設定」を実行し、「ページ設定」ダイアログボックスを表示する。"]
[null,null,null,"②「シート」タブをクリックして「白黒印刷」チェックボックスをオンにする。"]
[]
[null,null,null,"「印刷プレビュー」→「ページ設定」→「シート」タブ→印刷の「白黒印刷」にチェック→「OK」→印刷"]

{"sheet":"第1号","index":1,"n_rows":45,"n_cols":20,"rows_kept":45,"cut":false,"hidden":false,"merged":[[49,9,49,16],[50,9,50,11],[50,12,50,15],[13,9,13,16],[14,9,14,16],[48,9,48,16],[23,1,23,16],[24,2,24,5],[22,1,22,16],[39,2,39,4],[39,5,39,16],[44,2,44,4],[44,5,44,13],[44,14,44,16],[41,2,41,4],[41,5,41,16],[2,10,2,11],[11,12,11,16],[9,9,9,16],[12,9,12,16],[15,9,15,16],[10,9,10,16],[11,9,11,11],[19,1,19,16],[32,1,33,5],[32,6,33,16],[24,6,24,16],[25,2,31,5],[25,10,25,14],[27,10,27,14],[29,10,29,14],[31,10,31,14],[43,2,43,4],[43,5,43,16],[36,2,37,16],[38,2,38,4],[38,5,38,16],[40,2,40,4],[40,5,40,16],[42,2,42,4],[42,5,42,16]]}
[" ","第１号様式（第８条関係) ",null,null,null,null,null,null,null,null,null,null,null,null,null,null,"1/2枚目"]
[]
[null,null,null,null,null,null,null,null,null,null,null,null,"年",null,"月",null,"日",null,null,"←手入力"]
[]
["公益財団法人　東京都環境公社"]
["　理事長　殿"]
[]
[]
[null,null,null,null,null,null,null,null,"（助成対象事業者）"]
[null,null,null,null,null,null,null,null,"住　所："]
[null,null,null,null,null,null,null,null,"名　称："]
[null,null,null,null,null,null,null,null,"代表者の職・氏名："]
[null,null,null,null,null,null,null,null,"担当者所　属部課名："]
[null,null,null,null,null,null,null,null,"氏名："]
[null,null,null,null,null,null,null,null,"電話番号："]
[null,null,null,null,null,null,null,null,"E-mail：",""]
[]
[null,"再エネ設備の新規導入につながる電力調達構築事業"]
[]
[null,"助成金交付申請書"]
[]
[null,null,"【第一面】"]
[null,"再エネ設備の新規導入につながる電力調達構築事業助成金交付要綱（令和３年８月19日付３都環公地温第1050号 ） 第8条第1項の規定に基づき、下記のとおり助成金の交付を申請します。"]
[null,"記"]
[null,null,"助成対象事業の名称"]
[null,null,"助成金交付申請額等",null,null,null,null,"(1) 助成事業に要する経費",null,null,null,null,null,null,null,"円","(税抜)"]
[]
[null,null,null,null,null,null,null,"(2) 他助成金等受給(予定)額",null,null,null,null,null,null,null,"円"]
[]
[null,null,null,null,null,null,null,"(3) 助成対象経費",null,null,null,null,null,null,null,"円"]
[]
[null,null,null,null,null,null,null,"(4) 助成金交付申請額",null,null,null,null,null,null,null,"円"]
[null,"助成金交付予定先となる事業者"]
[]
[null,null,"※(2)他助成金等受給(予定)額はその他執行団体等の補助金・助成金"]
[null,null,null,null,"を申請しない場合は【0】を記入してください"]
[null,null,"(2)他助成金等受給(予定)額の項目で【0】以外を記入した場合、以下の項目に情報を記入してください"]
[]
[null,null,"助成金等の名称"]
[null,null,"助成金等の\n交付機関名称"]
[null,null,"助成金等の目的"]
[null,null,"実施期間（開始）"]
[null,null,"実施期間（終了）"]
[null,null,"交付決定時期"]
[null,null,"交付申請額",null,null,null,null,null,null,null,null,null,null,null," 円"]

{"sheet":"第1号 第二面","index":2,"n_rows":38,"n_cols":23,"rows_kept":38,"cut":false,"hidden":false,"merged":[[7,2,14,5],[7,8,7,16],[8,8,8,16],[9,8,9,16],[11,9,11,16],[12,9,12,16],[13,9,13,16],[14,9,14,16],[10,8,10,10],[10,11,10,16],[15,2,22,5],[15,8,15,16],[16,8,16,16],[17,8,17,16],[19,9,19,16],[20,9,20,16],[21,9,21,16],[22,9,22,16],[18,8,18,10],[18,11,18,16],[23,2,30,5],[23,8,23,16],[24,8,24,16],[25,8,25,16],[27,9,27,16],[28,9,28,16],[29,9,29,16],[30,9,30,16],[26,8,26,10],[26,11,26,16],[31,2,37,5],[31,8,31,16],[32,8,32,16],[34,9,34,16],[35,9,35,16],[36,9,36,16],[37,9,37,16],[33,8,33,10],[33,11,33,16],[38,1,40,2],[38,4,38,13],[38,14,40,16],[39,4,39,13],[40,4,40,13]]}
[null,"第１号様式 （第８条関係)",null,null,null,null,null,null,null,null,null,null,null,null,null,null,"2/2枚目"]
[]
[null,null,"【第二面】"]
[]
[null,null,"以下に、共同申請者、手続代行者を記入してください"]
[null,null,"※共同申請者、手続代行者は、必要な場合に記載してください"]
[]
[null,null,"共同申請者①",null,null,null,null,"名称",null,null,null,null,null,null,null,null,null,null,null,null,null,null,"プルダウンより選択してください"]
[null,null,null,null,null,null,null,"種別","プルダウンより選択してください",null,null,null,null,null,null,null,null,null,null,null,null,null,"発電事業者"]
[null,null,null,null,null,null,null,"住所",null,null,null,null,null,null,null,null,null,null,null,null,null,null,"小売電気事業者"]
[null,null,null,null,null,null,null,"代表者職・氏名",null,null,null,null,null,null,null,null,null,null,null,null,null,null,"電力需要家"]
[null,null,null,null,null,null,null,"担当者","部課名",null,null,null,null,null,null,null,null,null,null,null,null,null,"リース事業者"]
[null,null,null,null,null,null,null,null,"氏名"]
[null,null,null,null,null,null,null,null,"電話番号"]
[null,null,null,null,null,null,null,null,"E-mail"]
[null,null,"共同申請者②",null,null,null,null,"名称"]
[null,null,null,null,null,null,null,"種別","プルダウンより選択してください"]
[null,null,null,null,null,null,null,"住所"]
[null,null,null,null,null,null,null,"代表者職・氏名"]
[null,null,null,null,null,null,null,"担当者","部課名"]
[null,null,null,null,null,null,null,null,"氏名"]
[null,null,null,null,null,null,null,null,"電話番号"]
[null,null,null,null,null,null,null,null,"E-mail"]
[null,null,"共同申請者③",null,null,null,null,"名称"]
[null,null,null,null,null,null,null,"種別","プルダウンより選択してください"]
[null,null,null,null,null,null,null,"住所"]
[null,null,null,null,null,null,null,"代表者職・氏名"]
[null,null,null,null,null,null,null,"担当者","部課名"]
[null,null,null,null,null,null,null,null,"氏名"]
[null,null,null,null,null,null,null,null,"電話番号"]
[null,null,null,null,null,null,null,null,"E-mail"]
[null,null,"手続代行者",null,null,null,null,"名称"]
[null,null,null,null,null,null,null,"住所"]
[null,null,null,null,null,null,null,"代表者職・氏名"]
[null,null,null,null,null,null,null,"担当者","部課名"]
[null,null,null,null,null,null,null,null,"氏名"]
[null,null,null,null,null,null,null,null,"電話番号"]
[null,null,null,null,null,null,null,null,"E-mail"]

{"sheet":"第2号 (助成対象事業者用)","index":3,"n_rows":37,"n_cols":11,"rows_kept":37,"cut":false,"hidden":false,"merged":[[3,0,3,16],[4,0,4,16],[34,4,34,8],[12,2,12,14],[25,1,25,15],[27,3,27,4],[34,10,34,14],[23,2,23,15],[30,4,30,14],[32,4,32,14],[9,2,9,15],[10,2,10,15],[11,2,11,15],[19,2,19,15],[21,2,21,15]]}
[null,"第２号様式（第８条関係)"]
[]
[null,"再エネ設備の新規導入につながる電力調達構築事業"]
["誓　　約　　書"]
["【第一面】"]
[]
[null,"公益財団法人　東京都環境公社"]
[null,"　理事長　殿"]
[]
[null,1,"　再エネ設備の新規導入につながる電力調達構築事業助成金交付要綱（令和３年８月19日付３都環公地温第1050号。以下「交付要綱」という。）第８条の規定に基づく助成金の交付の申請を行うに当たり、当該申請により助成金等の交付を受けようとする者（法人その他の団体にあっては、代表者、役員又は使用人その他の従業員若しくは構成員を含む。）が交付要綱第４条に規定する助成対象事業者に該当し、将来にわたっても該当するよう法令等を遵守することをここに誓約いたします。"]
[null,2,"　この誓約に違反又は相違があり、交付要綱第24条の規定により助成金交付決定の全部又は一部の取消しを受けた場合において、交付要綱第25条に規定する助成金の返還を請求されたときは、これに異議なく応じることを誓約いたします。"]
[null,3,"　貴公社理事長又は東京都が必要と認めた場合には、暴力団関係者であるか否かの確認のため、警視庁へ照会がなされることに同意いたします。"]
[null,null,"※　この誓約書における「暴力団関係者」とは、次に掲げる者をいう。"]
[null,null,null,"・暴力団又は暴力団員が実質的に経営を支配する法人等に所属する者"]
[null,null,null,"・暴力団又員を雇用している者"]
[null,null,null,"・暴力団又は暴力団員を不当に利用していると認められる者"]
[null,null,null,"・暴力団の維持、運営に協力し、又は関与していると認められる者"]
[null,null,null,"・暴力団又は暴力団員と社会的に非難されるべき関係を有していると認められる者"]
[]
[null,4,"　当該申請した事業は、取得財産等の処分制限がかかる期間において「再生可能エネルギー電気の利用の促進に関する特別措置法」（平成23年法律第108号）第９条第４項の認定を受けないことに同意いたします。"]
[]
[null,5,"　再エネ設備の新規導入につながる電力調達構築事業助成金交付要綱、その他法令の規程を遵守することを誓約いたします。"]
[]
[null,6,"　本申請書は、事実に基づき、申請者の不利益にならない範囲において訂正される可能性があることについて同意いたします。"]
[]
[null,"以上の事項全てを満たすことを誓約いたします。"]
[]
[null,null,null,null,null,"年",null,"月",null,"日"]
[]
[null,null,null,"住所"]
[null,null,null,null,{"$f":"第1号!J10","v":0}]
[null,null,null,"名称"]
[null,null,null,null,{"$f":"第1号!J11","v":0}]
[null,null,null,"代表者の職・氏名"]
[null,null,null,null,{"$f":"第1号!J12","v":0},null,null,null,null,null,{"$f":"第1号!M12","v":0}]
[]
[null,"※　法人その他の団体にあっては、主たる事務所の所在地、名称及び代表者の氏名を記入すること。"]

{"sheet":"第2号 (共同申請者①用) ","index":4,"n_rows":37,"n_cols":11,"rows_kept":37,"cut":false,"hidden":false,"merged":[[34,4,34,8],[25,1,25,15],[27,3,27,4],[30,4,30,14],[32,4,32,14],[34,10,34,14],[21,2,21,15],[23,2,23,15],[12,2,12,14],[3,0,3,16],[4,0,4,16],[9,2,9,15],[10,2,10,15],[11,2,11,15],[19,2,19,15]]}
[null,"第２号様式（第８条関係)"]
[]
[null,"再エネ設備の新規導入につながる電力調達構築事業"]
["誓　　約　　書"]
["【第一面】"]
[]
[null,"公益財団法人　東京都環境公社"]
[null,"　理事長　殿"]
[]
[null,1,"　再エネ設備の新規導入につながる電力調達構築事業助成金交付要綱（令和３年８月19日付３都環公地温第1050号。以下「交付要綱」という。）第８条の規定に基づく助成金の交付の申請を行うに当たり、当該申請により助成金等の交付を受けようとする者（法人その他の団体にあっては、代表者、役員又は使用人その他の従業員若しくは構成員を含む。）が交付要綱第４条に規定する助成対象事業者に該当し、将来にわたっても該当するよう法令等を遵守することをここに誓約いたします。"]
[null,2,"　この誓約に違反又は相違があり、交付要綱第24条の規定により助成金交付決定の全部又は一部の取消しを受けた場合において、交付要綱第25条に規定する助成金の返還を請求されたときは、これに異議なく応じることを誓約いたします。"]
[null,3,"　貴公社理事長又は東京都が必要と認めた場合には、暴力団関係者であるか否かの確認のため、警視庁へ照会がなされることに同意いたします。"]
[null,null,"※　この誓約書における「暴力団関係者」とは、次に掲げる者をいう。"]
[null,null,null,"・暴力団又は暴力団員が実質的に経営を支配する法人等に所属する者"]
[null,null,null,"・暴力団又員を雇用している者"]
[null,null,null,"・暴力団又は暴力団員を不当に利用していると認められる者"]
[null,null,null,"・暴力団の維持、運営に協力し、又は関与していると認められる者"]
[null,null,null,"・暴力団又は暴力団員と社会的に非難されるべき関係を有していると認められる者"]
[]
[null,4,"　当該申請した事業は、取得財産等の処分制限がかかる期間において「再生可能エネルギー電気の利用の促進に関する特別措置法」（平成23年法律第108号）第９条第４項の認定を受けないことに同意いたします。"]
[]
[null,5,"　再エネ設備の新規導入につながる電力調達構築事業助成金交付要綱、その他法令の規程を遵守することを誓約いたします。"]
[]
[null,6,"　本申請書は、事実に基づき、申請者の不利益にならない範囲において訂正される可能性があることについて同意いたします。"]
[]
[null,"以上の事項全てを満たすことを誓約いたします。"]
[]
[null,null,null,null,null,"年",null,"月",null,"日"]
[]
[null,null,null,"住所"]
[null,null,null,null,{"$f":"'第1号 第二面'!I10","v":0}]
[null,null,null,"名称"]
[null,null,null,null,{"$f":"'第1号 第二面'!I8","v":0}]
[null,null,null,"代表者の職・氏名"]
[null,null,null,null,{"$f":"'第1号 第二面'!I11","v":0},null,null,null,null,null,{"$f":"'第1号 第二面'!L11","v":0}]
[]
[null,"※　法人その他の団体にあっては、主たる事務所の所在地、名称及び代表者の氏名を記入すること。"]

{"sheet":"第2号 (共同申請者②用) ","index":5,"n_rows":37,"n_cols":11,"rows_kept":37,"cut":false,"hidden":false,"merged":[[34,4,34,8],[34,10,34,14],[25,1,25,15],[27,3,27,4],[30,4,30,14],[32,4,32,14],[21,2,21,15],[23,2,23,15],[12,2,12,14],[3,0,3,16],[4,0,4,16],[9,2,9,15],[10,2,10,15],[11,2,11,15],[19,2,19,15]]}
[null,"第２号様式（第８条関係)"]
[]
[null,"再エネ設備の新規導入につながる電力調達構築事業"]
["誓　　約　　書"]
["【第一面】"]
[]
[null,"公益財団法人　東京都環境公社"]
[null,"　理事長　殿"]
[]
[null,1,"　再エネ設備の新規導入につながる電力調達構築事業助成金交付要綱（令和３年８月19日付３都環公地温第1050号。以下「交付要綱」という。）第８条の規定に基づく助成金の交付の申請を行うに当たり、当該申請により助成金等の交付を受けようとする者（法人その他の団体にあっては、代表者、役員又は使用人その他の従業員若しくは構成員を含む。）が交付要綱第４条に規定する助成対象事業者に該当し、将来にわたっても該当するよう法令等を遵守することをここに誓約いたします。"]
[null,2,"　この誓約に違反又は相違があり、交付要綱第24条の規定により助成金交付決定の全部又は一部の取消しを受けた場合において、交付要綱第25条に規定する助成金の返還を請求されたときは、これに異議なく応じることを誓約いたします。"]
[null,3,"　貴公社理事長又は東京都が必要と認めた場合には、暴力団関係者であるか否かの確認のため、警視庁へ照会がなされることに同意いたします。"]
[null,null,"※　この誓約書における「暴力団関係者」とは、次に掲げる者をいう。"]
[null,null,null,"・暴力団又は暴力団員が実質的に経営を支配する法人等に所属する者"]
[null,null,null,"・暴力団又員を雇用している者"]
[null,null,null,"・暴力団又は暴力団員を不当に利用していると認められる者"]
[null,null,null,"・暴力団の維持、運営に協力し、又は関与していると認められる者"]
[null,null,null,"・暴力団又は暴力団員と社会的に非難されるべき関係を有していると認められる者"]
[]
[null,4,"　当該申請した事業は、取得財産等の処分制限がかかる期間において「再生可能エネルギー電気の利用の促進に関する特別措置法」（平成23年法律第108号）第９条第４項の認定を受けないことに同意いたします。"]
[]
[null,5,"　再エネ設備の新規導入につながる電力調達構築事業助成金交付要綱、その他法令の規程を遵守することを誓約いたします。"]
[]
[null,6,"　本申請書は、事実に基づき、申請者の不利益にならない範囲において訂正される可能性があることについて同意いたします。"]
[]
[null,"以上の事項全てを満たすことを誓約いたします。"]
[]
[null,null,null,null,null,"年",null,"月",null,"日"]
[]
[null,null,null,"住所"]
[null,null,null,null,{"$f":"'第1号 第二面'!I18","v":0}]
[null,null,null,"名称"]
[null,null,null,null,{"$f":"'第1号 第二面'!I16","v":0}]
[null,null,null,"代表者の職・氏名"]
[null,null,null,null,{"$f":"'第1号 第二面'!I19","v":0},null,null,null,null,null,{"$f":"'第1号 第二面'!L19","v":0}]
[]
[null,"※　法人その他の団体にあっては、主たる事務所の所在地、名称及び代表者の氏名を記入すること。"]

{"sheet":"第2号 (共同申請者③用) ","index":6,"n_rows":37,"n_cols":11,"rows_kept":37,"cut":false,"hidden":false,"merged":[[34,4,34,8],[34,10,34,14],[25,1,25,15],[27,3,27,4],[30,4,30,14],[32,4,32,14],[3,0,3,16],[4,0,4,16],[21,2,21,15],[23,2,23,15],[12,2,12,14],[9,2,9,15],[10,2,10,15],[11,2,11,15],[19,2,19,15]]}
[null,"第２号様式（第８条関係)"]
[]
[null,"再エネ設備の新規導入につながる電力調達構築事業"]
["誓　　約　　書"]
["【第一面】"]
[]
[null,"公益財団法人　東京都環境公社"]
[null,"　理事長　殿"]
[]
[null,1,"　再エネ設備の新規導入につながる電力調達構築事業助成金交付要綱（令和３年８月19日付３都環公地温第1050号。以下「交付要綱」という。）第８条の規定に基づく助成金の交付の申請を行うに当たり、当該申請により助成金等の交付を受けようとする者（法人その他の団体にあっては、代表者、役員又は使用人その他の従業員若しくは構成員を含む。）が交付要綱第４条に規定する助成対象事業者に該当し、将来にわたっても該当するよう法令等を遵守することをここに誓約いたします。"]
[null,2,"　この誓約に違反又は相違があり、交付要綱第24条の規定により助成金交付決定の全部又は一部の取消しを受けた場合において、交付要綱第25条に規定する助成金の返還を請求されたときは、これに異議なく応じることを誓約いたします。"]
[null,3,"　貴公社理事長又は東京都が必要と認めた場合には、暴力団関係者であるか否かの確認のため、警視庁へ照会がなされることに同意いたします。"]
[null,null,"※　この誓約書における「暴力団関係者」とは、次に掲げる者をいう。"]
[null,null,null,"・暴力団又は暴力団員が実質的に経営を支配する法人等に所属する者"]
[null,null,null,"・暴力団又員を雇用している者"]
[null,null,null,"・暴力団又は暴力団員を不当に利用していると認められる者"]
[null,null,null,"・暴力団の維持、運営に協力し、又は関与していると認められる者"]
[null,null,null,"・暴力団又は暴力団員と社会的に非難されるべき関係を有していると認められる者"]
[]
[null,4,"　当該申請した事業は、取得財産等の処分制限がかかる期間において「再生可能エネルギー電気の利用の促進に関する特別措置法」（平成23年法律第108号）第９条第４項の認定を受けないことに同意いたします。"]
[]
[null,5,"　再エネ設備の新規導入につながる電力調達構築事業助成金交付要綱、その他法令の規程を遵守することを誓約いたします。"]
[]
[null,6,"　本申請書は、事実に基づき、申請者の不利益にならない範囲において訂正される可能性があることについて同意いたします。"]
[]
[null,"以上の事項全てを満たすことを誓約いたします。"]
[]
[null,null,null,null,null,"年",null,"月",null,"日"]
[]
[null,null,null,"住所"]
[null,null,null,null,{"$f":"'第1号 第二面'!I26","v":0}]
[null,null,null,"名称"]
[null,null,null,null,{"$f":"'第1号 第二面'!I24","v":0}]
[null,null,null,"代表者の職・氏名"]
[null,null,null,null,{"$f":"'第1号 第二面'!I27","v":0},null,null,null,null,null,{"$f":"'第1号 第二面'!L27","v":0}]
[]
[null,"※　法人その他の団体にあっては、主たる事務所の所在地、名称及び代表者の氏名を記入すること。"]

{"sheet":"第2号 (手続き代行者用)","index":7,"n_rows":32,"n_cols":11,"rows_kept":32,"cut":false,"hidden":false,"merged":[[4,0,4,16],[18,2,18,15],[19,2,19,15],[29,4,29,8],[22,3,22,4],[25,4,25,14],[27,4,27,14],[29,10,29,14],[10,2,10,14],[11,2,11,14],[5,0,5,16],[8,1,8,15],[9,2,9,15]]}
[null,"第２号様式（第８条関係)"]
[]
[]
[null,"再エネ設備の新規導入につながる電力調達構築事業"]
["誓　　約　　書"]
["【第二面】"]
[]
[]
[null,"　再エネ設備の新規導入につながる電力調達構築事業助成金交付要綱（令和３年８月19日付３都環公地温第1050号。以下「交付要綱」という。）第９条の規定に基づき、助成対象事業者から依頼を受け、当該申請に係る手続きの代行を行うもの（以下、「手続き代行者」という。）が、以下の項目について理解し、遵守することをここに誓約いたします。"]
[null,1,"　貴公社理事長又は東京都が必要と認めた場合には、暴力団関係者であるか否かの確認のため、警視庁へ照会がなされることに同意いたします。"]
[]
[null,null,"※　この誓約書における「暴力団関係者」とは、次に掲げる者をいう。"]
[null,null,null,"・暴力団又は暴力団員が実質的に経営を支配する法人等に所属する者"]
[null,null,null,"・暴力団又員を雇用している者"]
[null,null,null,"・暴力団又は暴力団員を不当に利用していると認められる者"]
[null,null,null,"・暴力団の維持、運営に協力し、又は関与していると認められる者"]
[null,null,null,"・暴力団又は暴力団員と社会的に非難されるべき関係を有していると認められる者"]
[]
[null,2,"　交付要綱及びその他公社が定める交付申請等に係る全ての要件を理解し、申請者との連携を図り、事業が円滑に推進できるよう努めることを誓約いたします。"]
[null,3,"　公社が必要に応じて実施する手続代行者が行う手続きについての調査により、手続代行者が交付要綱の規定に従って手続を遂行していないと認められ、代行の停止を求めたときは、これに異議なく応じることに同意いたします。"]
[]
[]
[null,null,null,null,null,"年",null,"月",null,"日"]
[]
[null,null,null,"住所"]
[null,null,null,null,{"$f":"'第1号 第二面'!I33","v":0}]
[null,null,null,"名称"]
[null,null,null,null,{"$f":"'第1号 第二面'!I32","v":0}]
[null,null,null,"代表者の職・氏名"]
[null,null,null,null,{"$f":"'第1号 第二面'!I34","v":0},null,null,null,null,null,{"$f":"'第1号 第二面'!L34","v":0}]
[]
[null,"※　法人その他の団体にあっては、主たる事務所の所在地、名称及び代表者の氏名を記入すること。"]

{"sheet":"第3号","index":8,"n_rows":30,"n_cols":23,"rows_kept":30,"cut":false,"hidden":false,"merged":[[2,13,2,14],[36,3,36,5],[32,6,32,8],[36,6,36,8],[6,6,6,17],[31,3,31,9],[35,3,35,9],[32,3,32,5],[10,2,10,18],[21,7,21,9],[15,5,15,18],[16,4,16,5],[16,6,16,18],[19,4,19,5],[19,6,19,18],[21,11,21,18],[39,3,39,9],[40,3,40,5],[40,6,40,8],[43,3,43,9],[7,3,7,5],[7,6,7,8],[12,3,12,19],[9,2,9,18],[23,8,23,18],[25,8,25,18],[27,8,27,18],[29,8,29,18]]}
[null,"第３号様式（第８条関係）"]
[]
[null,null,null,null,null,null,null,null,null,null,null,null,null,null,null,"年",null,"月",null,"日",null,null,"←手入力"]
[]
[null,null,null,"公益財団法人　東京都環境公社"]
[null,null,null,"　理事長　殿"]
[]
[]
[]
[null,null,"再エネ設備の新規導入につながる電力調達構築事業"]
[null,null,"助成対象事業の実施に係る同意書"]
[]
[null,null,null,"　再エネ設備の新規導入につながる電力調達構築事業助成金交付要綱（令和３年８月19日付３都環公地温第1050号）第３条、第５条、第12条、第29条、第34条、第35条及び第36条の規定を確認の上、上記の事業者の助成金交付申請に同意します。"]
[null,null,null,"１．助成対象設備の導入場所"]
[null,null,null,null,"（住所）"]
[]
[null,null,null,null,"名称"]
[]
[null,null,null,"２．　助成対象設備の",null,null,null,"導入先","選択してください","の所有者"]
[null,null,null,null,"会社名"]
[]
[null,null,null,null,null,"役職名",null,null,null,null,"（氏名）"]
[]
[null,null,null,null,null,"担当者",null,"部課名"]
[]
[null,null,null,null,null,null,null,"氏名"]
[]
[null,null,null,null,null,null,null,"電話番号"]
[]
[null,null,null,null,null,null,null,"E-mail"]

{"sheet":"第4号.バイオマス発電","index":9,"n_rows":103,"n_cols":8,"rows_kept":103,"cut":false,"hidden":false,"merged":[[108,2,108,4],[108,5,108,6],[108,7,108,9],[109,2,109,3],[109,6,109,9],[105,2,105,4],[105,5,105,9],[106,2,106,4],[106,5,106,9],[107,2,107,4],[107,5,107,6],[107,7,107,9],[100,2,100,3],[100,4,100,9],[101,2,101,3],[101,4,101,9],[102,1,102,3],[96,1,96,3],[99,1,99,3],[99,4,99,9],[96,4,96,9],[102,4,102,9],[93,1,93,3],[93,4,93,9],[94,2,94,3],[94,4,94,9],[95,2,95,3],[95,4,95,9],[88,2,88,3],[88,4,88,9],[89,2,89,3],[89,4,89,9],[90,1,90,3],[90,4,90,9],[84,1,84,3],[87,1,87,3],[87,4,87,9],[81,1,81,3],[81,4,81,9],[82,2,82,3],[82,4,82,9],[83,2,83,3],[83,4,83,9],[84,4,84,9],[76,2,76,3],[76,4,76,9],[77,2,77,3],[77,4,77,9],[78,1,78,3],[72,1,72,3],[75,1,75,3],[75,4,75,9],[72,4,72,9],[78,4,78,9],[69,1,69,3],[69,4,69,9],[70,2,70,3],[70,4,70,9],[71,2,71,3],[71,4,71,9],[64,2,64,3],[64,4,64,9],[65,2,65,3],[65,4,65,9],[66,1,66,3],[66,4,66,9],[60,1,60,3],[63,1,63,3],[63,4,63,9],[57,1,57,3],[57,4,57,9],[58,2,58,3],[58,4,58,9],[59,2,59,3],[59,4,59,9],[60,4,60,9],[52,2,52,3],[52,4,52,9],[53,2,53,3],[53,4,53,9],[54,1,54,3],[48,1,48,3],[51,1,51,3],[51,4,51,9],[48,4,48,9],[54,4,54,9],[45,1,45,3],[45,4,45,9],[46,2,46,3],[46,4,46,9],[47,2,47,3],[47,4,47,9],[39,2,39,3],[39,4,39,9],[40,2,40,3],[40,4,40,9],[41,1,41,3],[41,4,41,9],[35,1,35,3],[38,1,38,3],[38,4,38,9],[32,1,32,3],[32,4,32,9],[33,2,33,3],[33,4,33,9],[34,2,34,3],[34,4,34,9],[35,4,35,9],[27,2,27,3],[27,4,27,9],[28,2,28,3],[28,4,28,9],[29,1,29,3],[23,1,23,3],[26,1,26,3],[26,4,26,9],[23,4,23,9],[29,4,29,9],[20,1,20,3],[20,4,20,9],[21,2,21,3],[21,4,21,9],[22,2,22,3],[22,4,22,9],[16,2,16,3],[16,4,16,9],[17,1,17,3],[17,4,17,9],[10,2,10,4],[10,5,10,6],[10,8,10,9],[14,1,14,3],[14,4,14,9],[15,2,15,3],[15,4,15,9],[3,1,3,9],[7,2,7,4],[7,5,7,9],[8,2,8,4],[8,5,8,9],[9,2,9,4],[9,5,9,9]]}
[null,"第４号様式（第８条関係)"]
[]
["再エネ設備の新規導入につながる電力調達構築事業"]
[null,"事業実施計画書"]
[]
[null,"１．事業の概要"]
[null,"（１）事業の名称・設備の種別"]
[null,null,"再生可能エネルギー\n利用設備の種別",null,null,"バイオマス発電"]
[null,null,"助成対象事業の名称",null,null,{"$f":"第1号!G25","v":0}]
[null,null,"助成対象事業の目的"]
[null,null,"助成対象事業の開始及び\n完了予定日",null,null,null,null,"～"]
[]
[]
[null,"（２）－１．設備の導入場所"]
[null,"　　名称"]
[null,null,"フリガナ",null,{"$f":"PHONETIC(E17)","v":""}]
[null,null,"住所"]
[null,"　　所有代表者"]
[]
[null,"（２）－２．設備の導入場所"]
[null,"　　名称"]
[null,null,"フリガナ",null,{"$f":"PHONETIC(E23)","v":""}]
[null,null,"住所"]
[null,"　　所有代表者"]
[]
[null,"（２）－３．設備の導入場所"]
[null,"　　名称"]
[null,null,"フリガナ",null,{"$f":"PHONETIC(E29)","v":""}]
[null,null,"住所"]
[null,"　　所有代表者"]
[]
[null,"（２）－４．設備の導入場所"]
[null,"　　名称"]
[null,null,"フリガナ",null,{"$f":"PHONETIC(E35)","v":""}]
[null,null,"住所"]
[null,"　　所有代表者"]
[]
[null,"（２）－５．設備の導入場所"]
[null,"　　名称"]
[null,null,"フリガナ",null,{"$f":"PHONETIC(E41)","v":""}]
[null,null,"住所"]
[null,"　　所有代表者"]
[]
[]
[null,"（３）－１．需要先の情報"]
[null,"　　施設の名称"]
[null,null,"フリガナ",null,{"$f":"PHONETIC(E48)","v":""}]
[null,null,"住所"]
[null,"　　所有代表者"]
[]
[null,"（３）－２．需要先の情報"]
[null,"　　施設の名称"]
[null,null,"フリガナ",null,{"$f":"PHONETIC(E54)","v":""}]
[null,null,"住所"]
[null,"　　所有代表者"]
[]
[null,"（３）－３．需要先の情報"]
[null,"　　名称"]
[null,null,"フリガナ",null,{"$f":"PHONETIC(E60)","v":""}]
[null,null,"住所"]
[null,"　　所有代表者"]
[]
[null,"（３）－４．需要先の情報"]
[null,"　　施設の名称"]
[null,null,"フリガナ",null,{"$f":"PHONETIC(E66)","v":""}]
[null,null,"住所"]
[null,"　　所有代表者"]
[]
[null,"（３）－５．需要先の情報"]
[null,"　　施設の名称"]
[null,null,"フリガナ",null,{"$f":"PHONETIC(E72)","v":""}]
[null,null,"住所"]
[null,"　　所有代表者"]
[]
[null,"（３）－６．需要先の情報"]
[null,"　　施設の名称"]
[null,null,"フリガナ",null,{"$f":"PHONETIC(E78)","v":""}]
[null,null,"住所"]
[null,"　　所有代表者"]
[]
[null,"（３）－７．需要先の情報"]
[null,"　　施設の名称"]
[null,null,"フリガナ",null,{"$f":"PHONETIC(E84)","v":""}]
[null,null,"住所"]
[null,"　　所有代表者"]
[]
[null,"（３）－８．需要先の情報"]
[null,"　　施設の名称"]
[null,null,"フリガナ",null,{"$f":"PHONETIC(E90)","v":""}]
[null,null,"住所"]
[null,"　　所有代表者"]
[]
[null,"（３）－９．需要先の情報"]
[null,"　　施設の名称"]
[null,null,"フリガナ",null,{"$f":"PHONETIC(E96)","v":""}]
[null,null,"住所"]
[null,"　　所有代表者"]
[]
[null,"（３）－10．需要先の情報"]
[null,"　　施設の名称"]
[null,null,"フリガナ",null,{"$f":"PHONETIC(E102)","v":""}]
[null,null,"住所"]
[null,"　　所有代表者"]

{"sheet":"第4号.バイオマス発電設備の概要_１枚目","index":10,"n_rows":281,"n_cols":14,"rows_kept":281,"cut":false,"hidden":false,"merged":[[22,3,22,5],[22,6,22,8],[31,3,31,5],[31,6,31,8],[4,5,4,6],[8,2,8,4],[8,5,8,9],[10,3,10,4],[39,3,39,5],[39,6,39,8],[14,3,14,5],[14,6,14,8],[15,3,15,5],[17,3,17,5],[17,6,17,8],[28,3,28,5],[28,6,28,8],[15,6,15,8],[16,3,16,5],[16,6,16,8],[29,3,29,5],[29,6,29,8],[21,3,21,5],[21,6,21,8],[62,3,62,5],[38,3,38,5],[38,6,38,8],[32,3,32,5],[32,6,32,8],[36,3,36,5],[36,6,36,8],[37,3,37,5],[37,6,37,8],[44,3,44,5],[44,6,44,8],[46,3,46,5],[46,6,46,8],[47,3,47,5],[40,3,40,5],[40,6,40,8],[41,3,41,5],[41,6,41,8],[43,3,43,5],[43,6,43,8],[45,3,45,5],[45,6,45,8],[47,6,47,8],[62,6,62,8],[59,3,59,5],[59,6,59,8],[48,3,48,5],[48,6,48,8],[50,3,50,5],[50,6,50,8],[60,3,60,5],[60,6,60,8],[61,3,61,5],[51,6,51,8],[51,3,51,5],[53,6,53,8],[54,3,54,5],[54,6,54,8],[55,3,55,5],[55,6,55,8],[61,6,61,8],[53,3,53,5],[52,3,52,5],[52,6,52,8],[63,3,63,5],[63,6,63,8],[76,3,76,5],[76,6,76,8],[77,3,77,5],[77,6,77,8],[78,3,78,5],[68,3,68,5],[68,6,68,8],[64,3,64,5],[64,6,64,8],[66,3,66,5],[66,6,66,8],[67,3,67,5],[67,6,67,8],[75,3,75,5],[75,6,75,8],[70,3,70,5],[70,6,70,8],[69,3,69,5],[69,6,69,8],[71,3,71,5],[73,3,73,5],[73,6,73,8],[99,3,99,5],[99,6,99,8],[100,3,100,5],[100,6,100,8],[101,3,101,5],[101,6,101,8],[108,3,108,5],[84,6,84,8],[91,6,91,8],[108,6,108,8],[93,6,93,8],[94,3,94,5],[94,6,94,8],[86,3,86,5],[86,6,86,8],[97,3,97,5],[97,6,97,8],[98,3,98,5],[98,6,98,8],[92,3,92,5],[92,6,92,8],[93,3,93,5],[109,3,109,5],[109,6,109,8],[110,3,110,5],[110,6,110,8],[105,3,105,5],[105,6,105,8],[106,3,106,5],[106,6,106,8],[107,3,107,5],[107,6,107,8],[220,3,220,5],[220,6,220,9],[221,6,221,9],[221,3,221,5],[223,3,223,5],[223,6,223,9],[228,3,228,5],[226,3,226,5],[226,6,226,9],[224,3,224,5],[224,6,224,9],[225,3,225,5],[225,6,225,9],[193,3,193,5],[193,6,193,9],[185,3,185,5],[176,6,176,9],[168,3,168,5],[163,6,163,9],[168,6,168,9],[169,3,169,5],[169,6,169,9],[170,3,170,5],[174,3,174,5],[174,6,174,9],[175,3,175,5],[175,6,175,9],[192,6,192,9],[185,6,185,9],[181,6,181,9],[182,3,182,5],[165,3,165,5],[182,6,182,9],[186,6,186,9],[187,3,187,5],[187,6,187,9],[188,6,188,9],[120,3,120,5],[120,6,120,8],[121,3,121,5],[121,6,121,8],[207,6,207,9],[208,3,208,5],[208,6,208,9],[171,6,171,9],[122,3,122,5],[122,6,122,8],[123,3,123,5],[123,6,123,8],[124,3,124,5],[124,6,124,8],[164,3,164,5],[148,3,148,4],[156,6,156,8],[157,3,157,5],[157,6,157,8],[158,3,158,5],[158,6,158,8],[186,3,186,5],[159,3,159,5],[159,6,159,8],[115,3,115,5],[115,6,115,8],[116,3,116,5],[116,6,116,8],[117,3,117,5],[117,6,117,8],[112,3,112,5],[112,6,112,8],[113,3,113,5],[113,6,113,8],[114,3,114,5],[114,6,114,8],[148,6,148,8],[152,3,152,5],[152,6,152,8],[156,3,156,5],[165,6,165,9],[166,6,166,9],[173,3,173,5],[173,6,173,9],[176,3,176,5],[163,3,163,5],[74,3,74,5],[74,6,74,8],[71,6,71,8],[78,6,78,8],[83,3,83,5],[83,6,83,8],[84,3,84,5],[180,3,180,5],[180,6,180,9],[119,3,119,5],[119,6,119,8],[87,6,87,8],[96,3,96,5],[96,6,96,8],[89,3,89,5],[89,6,89,8],[82,3,82,5],[82,6,82,8],[91,3,91,5],[87,3,87,5],[90,3,90,5],[90,6,90,8],[85,3,85,5],[85,6,85,8],[183,3,183,5],[183,6,183,9],[259,1,259,2],[248,6,248,9],[241,3,241,5],[241,6,241,9],[242,3,242,5],[242,6,242,9],[243,3,243,5],[243,6,243,9],[245,6,245,9],[245,3,245,5],[246,6,246,9],[246,3,246,5],[247,3,247,5],[247,6,247,9],[248,3,248,5],[214,3,214,5],[214,6,214,9],[207,3,207,5],[211,6,211,9],[209,3,209,5],[209,6,209,9],[218,3,218,5],[260,1,260,2],[261,1,261,2],[262,1,262,2],[263,1,263,2],[254,1,255,2],[254,3,255,3],[254,4,254,9],[276,5,276,6],[264,1,264,2],[265,1,265,2],[266,1,266,2],[267,1,267,2],[268,1,268,2],[269,1,269,2],[270,1,270,2],[257,1,257,2],[258,1,258,2],[274,5,274,6],[256,1,256,2],[272,5,272,6],[149,13,150,15],[166,3,166,5],[188,3,188,5],[190,3,190,5],[190,6,190,9],[204,3,204,5],[206,3,206,5],[206,6,206,9],[211,3,211,5],[201,3,201,5],[201,6,201,9],[202,3,202,5],[202,6,202,9],[203,3,203,5],[203,6,203,9],[204,6,204,9],[191,3,191,5],[191,6,191,9],[192,3,192,5],[170,6,170,9],[171,3,171,5],[153,12,154,12],[181,3,181,5],[164,6,164,9],[212,3,212,5],[212,6,212,9],[213,3,213,5],[231,6,231,9],[240,3,240,5],[229,6,229,9],[238,3,238,5],[235,3,235,5],[235,6,235,9],[236,3,236,5],[236,6,236,9],[237,3,237,5],[237,6,237,9],[238,6,238,9],[230,3,230,5],[231,3,231,5],[229,3,229,5],[240,6,240,9],[230,6,230,9],[213,6,213,9],[228,6,228,9],[218,6,218,9],[219,3,219,5],[219,6,219,9]]}
[null,"２．設備の概要（１枚目）"]
[null,"　※複数の型式を導入する場合は、それぞれの型式ごとにまとめること。"]
[]
[null,"（１）発電機総出力（事業費合計値）"]
[null,null,null,"発電機総出力",null,{"$f":"IF(G11=\"\",\"\",G11+'第4号.バイオマス発電設備の概要_２枚目 '!G8+'第4号.バイオマス発電設備の概要_３枚目'!G8+'第4号.バイオマス発電設備の概要_４枚目'!G8+'第4号.バイオマス発電設備の概要_５枚目'!G8)","v":0},null,"kW"]
[]
[null,"（２）設備導入場所ごとの設備概要"]
[]
[null,null,"導入場所名称",null,null,{"$f":"'第4号.バイオマス発電'!E15","v":0}]
[]
[null,null,null,"発電機総出力",null,null,{"$f":"IF(G40=\"\",0,ROUNDDOWN(SUM(G42,G49,G56),0))","v":0},"kW",null,null,null,null,"※発電出力10kW以上"]
[]
[]
[null,"（３）バイオマス発電設備"]
[null,null,null,"形態",null,null,null,null,null,null,null,null,"←プルダウンリストから選択してください"]
[null,null,null,"１日あたりの設備稼働時間",null,null,null,null,null,"ｈ/日"]
[null,null,null,"年間稼働日数",null,null,null,null,null,"日"]
[null,null,null,"年間稼働時間",null,null,{"$f":"IF(G16=\"\",\"\",ROUNDDOWN((G16*G17),2))","v":""},null,null,"ｈ/年"]
[]
[]
[null,"（４）バイオマス燃料"]
[null,null,null,"種類"]
[null,null,null,"バイオマス依存率（※）",null,null,{"$f":"'別紙１(1)'!$H$47","v":0},null,null,"％",null,null,"←別紙４を作成すると自動計算されます"]
[null,null,null,"※算定方法は、別紙3のとおり。",null,null,null,null,null,null,null,null,"※バイオマス依存率60％以上"]
[]
[]
[null,"（５）助成燃料等　（※使用する場合のみ記入）"]
[null,null,null,"スタートアップの場合"]
[null,null,null,"使用量",null,null,null,null,null,"ｔ/回"]
[null,null,null,"使用頻度",null,null,null,null,null,"回/年"]
[null,null,null,"その他"]
[null,null,null,"使用量",null,null,null,null,null,"ｔ/回"]
[null,null,null,"使用頻度",null,null,null,null,null,"回/年"]
[]
[]
[null,"（６）発電機"]
[null,null,"①","製造者名（メーカー名）"]
[null,null,null,"型式名"]
[null,null,null,"発電方式",null,null,null,null,null,null,null,null,"←プルダウンリストから選択してください"]
[null,null,null,"１台あたりの定格出力",null,null,null,null,null,"kW"]
[null,null,null,"台数",null,null,null,null,null,"台"]
[null,null,null,"定格出力合計",null,null,{"$f":"IF(G40=\"\",\"\",ROUNDDOWN(G40*G41,1))","v":""},null,null,"kW"]
[]
[null,null,"②","製造者名（メーカー名）"]
[null,null,null,"型式名"]
[null,null,null,"発電方式",null,null,null,null,null,null,null,null,"←プルダウンリストから選択してください"]
[null,null,null,"１台あたりの定格出力",null,null,null,null,null,"kW"]
[null,null,null,"台数",null,null,null,null,null,"台"]
[null,null,null,"定格出力合計",null,null,{"$f":"IF(G47=\"\",\"\",ROUNDDOWN(G47*G48,1))","v":""},null,null,"kW"]
[]
[null,null,"③","製造者名（メーカー名）"]
[null,null,null,"型式名"]
[null,null,null,"発電方式",null,null,null,null,null,null,null,null,"←プルダウンリストから選択してください"]
[null,null,null,"１台あたりの定格出力",null,null,null,null,null,"kW"]
[null,null,null,"台数",null,null,null,null,null,"台"]
[null,null,null,"定格出力合計",null,null,{"$f":"IF(G54=\"\",\"\",ROUNDDOWN(G54*G55,1))","v":""},null,null,"kW"]
[]
[]
[null,"（７）バイオマスボイラ-"]
[null,null,"①","製造者名（メーカー名）"]
[null,null,null,"型式名"]
[null,null,null,"機器の種類"]
[null,null,null,"１台あたりの能力",null,null,null,null,null,"kW"]
[null,null,null,"台数",null,null,null,null,null,"台"]
[null,null,null,"能力合計",null,null,{"$f":"IF(G63=\"\",\"\",ROUNDDOWN(G63*G64,2))","v":""},null,null,"kW"]
[]
[null,null,"②","製造者名（メーカー名）"]
[null,null,null,"型式名"]
[null,null,null,"機器の種類"]
[null,null,null,"１台あたりの能力",null,null,null,null,null,"kW"]
[null,null,null,"台数",null,null,null,null,null,"台"]
[null,null,null,"能力合計",null,null,{"$f":"IF(G70=\"\",\"\",ROUNDDOWN(G70*G71,2))","v":""},null,null,"kW"]
[]
[null,null,"③","製造者名（メーカー名）"]
[null,null,null,"型式名"]
[null,null,null,"機器の種類"]
[null,null,null,"１台あたりの能力",null,null,null,null,null,"kW"]
[null,null,null,"台数",null,null,null,null,null,"台"]
[null,null,null,"能力合計",null,null,{"$f":"IF(G77=\"\",\"\",ROUNDDOWN(G77*G78,2))","v":""},null,null,"kW"]
[]
[]
[null,"（８）バイオマス受入・供給設備　（※設置する場合のみ記入）"]
[null,null,"①","製造者名（メーカー名）"]
[null,null,null,"型式名"]
[null,null,null,"機器の種類"]
[null,null,null,"１基あたりの容量",null,null,null,null,null,"ｍ3"]
[null,null,null,"台数",null,null,null,null,null,"基"]
[null,null,null,"容量合計",null,null,{"$f":"IF(G86=\"\",\"\",ROUNDDOWN(G86*G87,2))","v":""},null,null,"ｍ3"]
[]
[null,null,"②","製造者名（メーカー名）"]
[null,null,null,"型式名"]
[null,null,null,"機器の種類"]
[null,null,null,"１基あたりの容量",null,null,null,null,null,"ｍ3"]
[null,null,null,"台数",null,null,null,null,null,"基"]
[null,null,null,"容量合計",null,null,{"$f":"IF(G93=\"\",\"\",ROUNDDOWN(G93*G94,2))","v":""},null,null,"ｍ3"]
[]
[null,null,"③","製造者名（メーカー名）"]
[null,null,null,"型式名"]
[null,null,null,"機器の種類"]
[null,null,null,"１基あたりの容量",null,null,null,null,null,"ｍ3"]
[null,null,null,"台数",null,null,null,null,null,"基"]
[null,null,null,"容量合計",null,null,{"$f":"IF(G100=\"\",\"\",ROUNDDOWN(G100*G101,2))","v":""},null,null,"ｍ3"]
[]
[]
[null,"（９）冷却塔　（※設置する場合のみ記入）"]
[null,null,"①","製造者名（メーカー名）"]
[null,null,null,"型式名"]
[null,null,null,"機器の種類"]
[null,null,null,"１台あたりの能力",null,null,null,null,null,"kW"]
[null,null,null,"台数",null,null,null,null,null,"台"]
[null,null,null,"能力合計",null,null,{"$f":"IF(G109=\"\",\"\",ROUNDDOWN(G109*G110,2))","v":""},null,null,"kW"]
[]
[null,null,"②","製造者名（メーカー名）"]
[null,null,null,"型式名"]
[null,null,null,"機器の種類"]
[null,null,null,"１台あたりの能力",null,null,null,null,null,"kW"]
[null,null,null,"台数",null,null,null,null,null,"台"]
[null,null,null,"能力合計",null,null,{"$f":"IF(G116=\"\",\"\",ROUNDDOWN(G116*G117,2))","v":""},null,null,"kW"]
[]
[null,null,"③","製造者名（メーカー名）"]
[null,null,null,"型式名"]
[null,null,null,"機器の種類"]
[null,null,null,"１台あたりの能力",null,null,null,null,null,"kW"]
[null,null,null,"台数",null,null,null,null,null,"台"]
[null,null,null,"能力合計",null,null,{"$f":"IF(G123=\"\",\"\",ROUNDDOWN(G123*G124,2))","v":""},null,null,"kW"]
[]
[]
[null,null,"［添付資料］"]
[null,null,"・","主要設備のカタログ、パンフレット等",null,null,"（添付資料７）"]
[null,null,"・","システム系統図",null,null,"（添付資料８）"]
[null,null,"・","単線結線図",null,null,"（添付資料９）"]
[null,null,"・","機器配置図",null,null,"（添付資料10）"]
[null,null,"・","バイオマスの調達に係る資料",null,null,"（添付資料14）"]
[null,null,"・","灰の処分に係る資料",null,null,"（添付資料15）"]
[null,null,"・","低位発熱量を証明する資料",null,null,"（添付資料16）"]
[]
[]
[]
[]
[]
[]
[]
[]
[]
[]
[]
[null,"※バイオマス燃料製造を実施する場合のみ"]
[null,"（10）バイオマス燃料製造方式"]
[null,null,null,"形態　　：",null,null,"メタン発酵方式",null,null,null,null,null,"←プルダウンリストから選択してください"]
[null,null,null,null,null,null,null,null,null,null,null,null,null,"１．メタン発酵方式"]
[]
[null,"（11）製造時のバイオマス依存率",null,null,null,null,null,null,null,null,null,null,null,"　・ガス製造量：100 N㎥／日 以上"]
[null,null,null,"バイオマス依存率",null,null,{"$f":"'別紙１(2)'!$H$47","v":0},null,null,"％",null,null,"←別紙４を作成すると自動計算される","　・低位発熱量：18.84 MJ／N㎥（4,500kcal／N ㎥）以上"]
[null,null,null,null,null,null,null,null,null,null,null,null,"※バイオマス依存率60％以上"]
[]
[null,"（12）製造するバイオマス燃料",null,null,null,null,null,null,null,null,null,null,null,"２．メタン発酵方式以外"]
[null,null,null,"名称",null,null,null,null,null,null,null,null,null,"　・製造量：固形化 150kg／日 以上"]
[null,null,null,"形態",null,null,null,null,null,null,null,null,"←プルダウンリストから選択してください","　　　　　　　液 化 100kg／日 以上"]
[null,null,null,"製造量",null,null,null,null,null,{"$f":"IF(G158<>\"気体\",\"kg/日\",\"N㎥/日\")","v":"kg/日"},null,null,null,"　　　　　　　ガス化 450N㎥／日 以上"]
[null,null,null,"低位発熱量",null,null,null,null,null,{"$f":"IF(G158<>\"気体\",\"MJ/kg\",\"MJ/N㎥\")","v":"MJ/kg"},null,null,null,"（ただし、離島及びへき地は、上記要件を除く。）"]
[]
[]
[null,"（13）バイオマス燃料製造設備"]
[null,null,"①","製造者名（メーカー名）"]
[null,null,null,"型式名"]
[null,null,null,"機器の種類"]
[null,null,null,"能力・容量"]
[]
[null,null,"②","製造者名（メーカー名）"]
[null,null,null,"型式名"]
[null,null,null,"機器の種類"]
[null,null,null,"能力・容量"]
[]
[null,null,"③","製造者名（メーカー名）"]
[null,null,null,"型式名"]
[null,null,null,"機器の種類"]
[null,null,null,"能力・容量"]
[]
[]
[null,"（14）バイオマス原料受入・供給設備"]
[null,null,"①","製造者名（メーカー名）"]
[null,null,null,"型式名"]
[null,null,null,"機器の種類"]
[null,null,null,"能力・容量"]
[]
[null,null,"②","製造者名（メーカー名）"]
[null,null,null,"型式名"]
[null,null,null,"機器の種類"]
[null,null,null,"能力・容量"]
[]
[null,null,"③","製造者名（メーカー名）"]
[null,null,null,"型式名"]
[null,null,null,"機器の種類"]
[null,null,null,"能力・容量"]
[]
[]
[]
[]
[]
[]
[null,"（15）バイオマス燃料貯蔵設備"]
[null,null,"①","製造者名（メーカー名）"]
[null,null,null,"型式名"]
[null,null,null,"機器の種類"]
[null,null,null,"能力・容量"]
[]
[null,null,"②","製造者名（メーカー名）"]
[null,null,null,"型式名"]
[null,null,null,"機器の種類"]
[null,null,null,"能力・容量"]
[]
[null,null,"③","製造者名（メーカー名）"]
[null,null,null,"型式名"]
[null,null,null,"機器の種類"]
[null,null,null,"能力・容量"]
[]
[]
[null,"（16）前処理設備"]
[null,null,"①","製造者名（メーカー名）"]
[null,null,null,"型式名"]
[null,null,null,"機器の種類"]
[null,null,null,"能力・容量"]
[]
[null,null,"②","製造者名（メーカー名）"]
[null,null,null,"型式名"]
[null,null,null,"機器の種類"]
[null,null,null,"能力・容量"]
[]
[null,null,"③","製造者名（メーカー名）"]
[null,null,null,"型式名"]
[null,null,null,"機器の種類"]
[null,null,null,"能力・容量"]
[]
[]
[null,"（17）後処理設備"]
[null,null,"①","製造者名（メーカー名）"]
[null,null,null,"型式名"]
[null,null,null,"機器の種類"]
[null,null,null,"能力・容量"]
[]
[null,null,"②","製造者名（メーカー名）"]
[null,null,null,"型式名"]
[null,null,null,"機器の種類"]
[null,null,null,"能力・容量"]
[]
[null,null,"③","製造者名（メーカー名）"]
[null,null,null,"型式名"]
[null,null,null,"機器の種類"]
[null,null,null,"能力・容量"]
[]
[]
[null,"※バイオマス燃料製造を実施する場合のみ"]
[null,"・利用計画及び生産計画"]
[null,null,null,null,null,null,null,"（単位：",{"$f":"IF(G172<>\"気体\",\"kg\",\"N㎥\")","v":"kg"},"/年）"]
[null,"年次",null,"年間生産量","バイオマス燃料年間利用量"]
[null,null,null,null,null,null,null,null,null,"合計"]
[null,"1年目",null,null,null,null,null,null,null,{"$f":"SUM(E257:I257)","v":0}]
[null,"2年目",null,null,null,null,null,null,null,0]
[null,"3年目",null,null,null,null,null,null,null,0]
[null,"4年目",null,null,null,null,null,null,null,0]
[null,"5年目",null,null,null,null,null,null,null,0]
[null,"6年目",null,null,null,null,null,null,null,0]
[null,"7年目",null,null,null,null,null,null,null,0]
[null,"8年目",null,null,null,null,null,null,null,0]
[null,"9年目",null,null,null,null,null,null,null,0]
[null,"10年目",null,null,null,null,null,null,null,0]
[null,"11年目",null,null,null,null,null,null,null,0]
[null,"12年目",null,null,null,null,null,null,null,0]
[null,"13年目",null,null,null,null,null,null,null,0]
[null,"14年目",null,null,null,null,null,null,null,0]
[null,"15年目",null,null,null,null,null,null,null,0]
[]
[null,null,"年間最大生産量",null,null,{"$f":"MAX(D257:D271)","v":0}]
[]
[null,null,"年間最大利用量",null,null,{"$f":"MAX(J257:J271)","v":0}]
[]
[null,null,"設備利用率",null,null,{"$f":"IF(D257=\"\",\"\",F275/F273*100)","v":""},null,"％"]
[]
[null,"［添付資料］"]
[null,null,"・バイオマス燃料利用計画",null,null,null,null,"（添付資料17）"]
[null,null,"・バイオマス燃料製造計画",null,null,null,null,"（添付資料18）"]

{"sheet":"別紙１(1)","index":11,"n_rows":50,"n_cols":13,"rows_kept":50,"cut":false,"hidden":false,"merged":[[21,1,40,1],[21,2,22,3],[21,7,21,9],[22,7,22,9],[10,7,10,9],[11,7,11,9],[12,7,12,9],[13,7,13,9],[14,7,14,9],[15,7,15,9],[9,2,13,2],[14,2,15,2],[16,2,18,2],[4,1,18,1],[4,2,5,3],[16,7,16,9],[17,7,17,9],[18,7,18,9],[2,1,2,9],[19,8,19,9],[4,7,4,9],[5,7,5,9],[6,7,6,9],[7,7,7,9],[8,7,8,9],[9,7,9,9],[6,2,8,2],[39,2,40,2],[39,7,39,9],[38,7,38,9],[40,7,40,9],[23,7,23,9],[24,7,24,9],[25,7,25,9],[26,7,26,9],[29,7,29,9],[30,7,30,9],[31,7,31,9],[32,7,32,9],[42,2,42,3],[46,7,46,8],[45,6,45,9],[45,1,45,3],[27,7,27,9],[28,7,28,9],[23,2,32,2],[35,7,35,9],[36,7,36,9],[37,7,37,9],[35,2,38,2],[41,7,42,7],[41,8,42,9],[33,2,34,2],[33,7,33,9],[34,7,34,9]]}
[null,"第４号様式：別紙１（１）（１枚目）"]
[]
[null,"バイオマス依存率計算書（バイオマス発電）"]
[]
[null,"バイオマス燃料","種類",null,"構成比","Ａ．バイオマス\n（燃料）利用量","Ｂ．バイオマス\n（燃料）低位発熱量","バイオマス\n（燃料）発熱量"]
[null,null,null,null,"％","kg/h",{"$f":"IF(F6=\"kg/h\",\"MJ/kg\",\"MJ/N㎥\")","v":"MJ/kg"},"MJ/h",null,null,null,null,"←利用量の単位は、プルダウンリストから選択してください"]
[null,null,"紙くず","紙類",{"$f":"IFERROR(F7/SUM($F$7:$F$19,$F$24:$F$41)*100,\"\")","v":""},null,null,{"$f":"F7*G7","v":0}]
[null,null,null,"新聞紙",{"$f":"IFERROR(F8/SUM($F$7:$F$19,$F$24:$F$41)*100,\"\")","v":""},null,null,{"$f":"F8*G8","v":0}]
[null,null,null,"紙管","",null,null,0]
[null,null,"木くず","草・木","",null,null,0]
[null,null,null,"おがくず",{"$f":"IFERROR(F11/SUM($F$7:$F$19,$F$24:$F$41)*100,\"\")","v":""},null,null,0]
[null,null,null,"木片","",null,null,0]
[null,null,null,"ベニア・合板・化粧版","",null,null,0]
[null,null,null,"集成材・ボード","",null,null,0]
[null,null,"繊維くず","木綿","",null,null,0]
[null,null,null,"羊毛","",null,null,0]
[null,null,"その他","一般雑芥","",null,null,0]
[null,null,null,"廃油(動植物系)","",null,null,0]
[null,null,null,"その他","",null,null,0]
[null,null,null,null,null,null,null,"①",{"$f":"SUM(H7:J19)","v":0}]
[]
[null,"非バイオマス燃料","種類",null,"構成比","Ｃ．非バイオマス\n（燃料）利用量","Ｄ．非バイオマス\n（燃料）低位発熱量","非バイオマス\n（燃料）発熱量"]
[null,null,null,null,"％",{"$f":"F6","v":"kg/h"},{"$f":"G6","v":"MJ/kg"},"MJ/h"]
[null,null,"廃プラスチック類","ポリエチレン（ＰＥ）",{"$f":"IFERROR(F24/SUM($F$7:$F$19,$F$24:$F$41)*100,\"\")","v":""},null,null,{"$f":"F24*G24","v":0}]
[null,null,null,"ポリプロピレン（ＰＰ）",{"$f":"IFERROR(F25/SUM($F$7:$F$19,$F$24:$F$41)*100,\"\")","v":""},null,null,0]
[null,null,null,"ポリスチレン（ＰＳ）",{"$f":"IFERROR(F26/SUM($F$7:$F$19,$F$24:$F$41)*100,\"\")","v":""},null,null,{"$f":"F26*G26","v":0}]
[null,null,null,"発泡スチロール","",null,null,0]
[null,null,null,"ＦＲＰ樹脂","",null,null,0]
[null,null,null,"フェノール樹脂","",null,null,0]
[null,null,null,"熱可塑性樹脂","",null,null,0]
[null,null,null,"混合樹脂製品","",null,null,0]
[null,null,null,"ＰＥＴボトル","",null,null,0]
[null,null,null,"皮製品","",null,null,0]
[null,null,"ゴムくず","タイヤ","",null,null,0]
[null,null,null,"合成ゴム","",null,null,0]
[null,null,"繊維くず","ナイロン布","",null,null,0]
[null,null,null,"アクリル布","",null,null,0]
[null,null,null,"ビニロン布","",null,null,0]
[null,null,null,"ポリエステル布","",null,null,0]
[null,null,"その他","廃油（石油系）","",null,null,0]
[null,null,null,"その他","",null,null,0]
[null,null,null,null,null,null,null,"②",{"$f":"SUM(H24:J41)","v":0}]
[null,null,"構成比の合計",null,{"$f":"SUM(E7:E19,E24:E41)","v":0}]
[]
[]
[null,"バイオマス依存率＝",null,null,null,null,"×100＝ ①/（①+②）×100"]
[null,null,null,null,null,null,"＝",{"$f":"IF(I20=0,0,I20/(I20+I42)*100)","v":0},null,"％",null,null,"※バイオマス依存率60％以上"]
[]
[null,null,"・バイオマス排水、家畜糞尿、食品残渣等を原料にする場合は、バイオマス依存率を１００％とする。"]
[null,null,"・メタン発酵方式の場合は、発酵槽へ投じられるものをバイオマス原料とする。"]

{"sheet":"別紙１(2)","index":12,"n_rows":50,"n_cols":13,"rows_kept":50,"cut":false,"hidden":false,"merged":[[2,1,2,9],[4,1,18,1],[4,2,5,3],[4,7,4,9],[5,7,5,9],[6,2,8,2],[6,7,6,9],[7,7,7,9],[8,7,8,9],[9,2,13,2],[9,7,9,9],[10,7,10,9],[11,7,11,9],[24,7,24,9],[25,7,25,9],[14,2,15,2],[14,7,14,9],[15,7,15,9],[32,7,32,9],[33,2,34,2],[33,7,33,9],[34,7,34,9],[12,7,12,9],[13,7,13,9],[21,2,22,3],[21,7,21,9],[22,7,22,9],[23,2,32,2],[28,7,28,9],[16,2,18,2],[16,7,16,9],[17,7,17,9],[18,7,18,9],[19,8,19,9],[26,7,26,9],[27,7,27,9],[29,7,29,9],[30,7,30,9],[31,7,31,9],[46,7,46,8],[35,2,38,2],[35,7,35,9],[36,7,36,9],[37,7,37,9],[38,7,38,9],[39,2,40,2],[39,7,39,9],[40,7,40,9],[41,7,42,7],[41,8,42,9],[42,2,42,3],[45,1,45,3],[45,6,45,9],[21,1,40,1],[23,7,23,9]]}
[null,"第４号様式：別紙１（２）（１枚目）"]
[]
[null,"バイオマス依存率計算書（バイオマス燃料製造）"]
[]
[null,"バイオマス燃料","種類",null,"構成比","Ａ．バイオマス\n（原料）利用量","Ｂ．バイオマス\n（原料）低位発熱量","バイオマス\n（原料）発熱量"]
[null,null,null,null,"％","kg/h",{"$f":"IF(F6=\"kg/h\",\"MJ/kg\",\"MJ/N㎥\")","v":"MJ/kg"},"MJ/h",null,null,null,null,"←利用量の単位は、プルダウンリストから選択してください"]
[null,null,"紙くず","紙類",{"$f":"IFERROR(F7/SUM($F$7:$F$19,$F$24:$F$41)*100,\"\")","v":""},null,null,{"$f":"F7*G7","v":0}]
[null,null,null,"新聞紙",{"$f":"IFERROR(F8/SUM($F$7:$F$19,$F$24:$F$41)*100,\"\")","v":""},null,null,{"$f":"F8*G8","v":0}]
[null,null,null,"紙管","",null,null,0]
[null,null,"木くず","草・木","",null,null,0]
[null,null,null,"おがくず","",null,null,0]
[null,null,null,"木片","",null,null,0]
[null,null,null,"ベニア・合板・化粧版","",null,null,0]
[null,null,null,"集成材・ボード","",null,null,0]
[null,null,"繊維くず","木綿","",null,null,0]
[null,null,null,"羊毛","",null,null,0]
[null,null,"その他","一般雑芥","",null,null,0]
[null,null,null,"廃油(動植物系)","",null,null,0]
[null,null,null,"その他","",null,null,0]
[null,null,null,null,null,null,null,"①",{"$f":"SUM(H7:J19)","v":0}]
[]
[null,"非バイオマス燃料","種類",null,"構成比","Ｃ．非バイオマス\n（原料）利用量","Ｄ．非バイオマス\n（原料）低位発熱量","非バイオマス\n（原料）発熱量"]
[null,null,null,null,"％",{"$f":"F6","v":"kg/h"},{"$f":"G6","v":"MJ/kg"},"MJ/h"]
[null,null,"廃プラスチック類","ポリエチレン（ＰＥ）",{"$f":"IFERROR(F24/SUM($F$7:$F$19,$F$24:$F$41)*100,\"\")","v":""},null,null,{"$f":"F24*G24","v":0}]
[null,null,null,"ポリプロピレン（ＰＰ）","",null,null,0]
[null,null,null,"ポリスチレン（ＰＳ）","",null,null,0]
[null,null,null,"発泡スチロール","",null,null,0]
[null,null,null,"ＦＲＰ樹脂","",null,null,0]
[null,null,null,"フェノール樹脂","",null,null,0]
[null,null,null,"熱可塑性樹脂","",null,null,0]
[null,null,null,"混合樹脂製品","",null,null,0]
[null,null,null,"ＰＥＴボトル","",null,null,0]
[null,null,null,"皮製品","",null,null,0]
[null,null,"ゴムくず","タイヤ","",null,null,0]
[null,null,null,"合成ゴム","",null,null,0]
[null,null,"繊維くず","ナイロン布","",null,null,0]
[null,null,null,"アクリル布","",null,null,0]
[null,null,null,"ビニロン布","",null,null,0]
[null,null,null,"ポリエステル布","",null,null,0]
[null,null,"その他","廃油（石油系）","",null,null,0]
[null,null,null,"その他","",null,null,0]
[null,null,null,null,null,null,null,"②",{"$f":"SUM(H24:J41)","v":0}]
[null,null,"構成比の合計",null,{"$f":"SUM(E7:E19,E24:E41)","v":0}]
[]
[]
[null,"バイオマス依存率＝",null,null,null,null,"×100＝ ①/（①+②）×100"]
[null,null,null,null,null,null,"＝",{"$f":"IF(I20=0,0,I20/(I20+I42)*100)","v":0},null,"％",null,null,"※バイオマス依存率60％以上"]
[]
[null,null,"・バイオマス排水、家畜糞尿、食品残渣等を原料にする場合は、バイオマス依存率を１００％とする。"]
[null,null,"・メタン発酵方式の場合は、発酵槽へ投じられるものをバイオマス原料とする。"]

{"sheet":"第4号.バイオマス発電設備の概要_２枚目 ","index":13,"n_rows":284,"n_cols":14,"rows_kept":284,"cut":false,"hidden":false,"merged":[[272,1,272,2],[273,1,273,2],[275,5,275,6],[277,5,277,6],[279,5,279,6],[266,1,266,2],[267,1,267,2],[268,1,268,2],[269,1,269,2],[270,1,270,2],[271,1,271,2],[260,1,260,2],[261,1,261,2],[262,1,262,2],[263,1,263,2],[264,1,264,2],[265,1,265,2],[251,3,251,5],[251,6,251,9],[257,1,258,2],[257,3,258,3],[257,4,257,9],[259,1,259,2],[248,3,248,5],[248,6,248,9],[249,3,249,5],[249,6,249,9],[250,3,250,5],[250,6,250,9],[244,3,244,5],[244,6,244,9],[245,3,245,5],[245,6,245,9],[246,3,246,5],[246,6,246,9],[240,3,240,5],[240,6,240,9],[241,3,241,5],[241,6,241,9],[243,3,243,5],[243,6,243,9],[234,3,234,5],[234,6,234,9],[238,3,238,5],[238,6,238,9],[239,3,239,5],[239,6,239,9],[231,3,231,5],[231,6,231,9],[232,3,232,5],[232,6,232,9],[233,3,233,5],[233,6,233,9],[227,3,227,5],[227,6,227,9],[228,3,228,5],[228,6,228,9],[229,3,229,5],[229,6,229,9],[223,3,223,5],[223,6,223,9],[224,3,224,5],[224,6,224,9],[226,3,226,5],[226,6,226,9],[217,3,217,5],[217,6,217,9],[221,3,221,5],[221,6,221,9],[222,3,222,5],[222,6,222,9],[214,3,214,5],[214,6,214,9],[215,3,215,5],[215,6,215,9],[216,3,216,5],[216,6,216,9],[210,3,210,5],[210,6,210,9],[211,3,211,5],[211,6,211,9],[212,3,212,5],[212,6,212,9],[206,3,206,5],[206,6,206,9],[207,3,207,5],[207,6,207,9],[209,3,209,5],[209,6,209,9],[190,3,190,5],[190,6,190,9],[204,3,204,5],[204,6,204,9],[205,3,205,5],[205,6,205,9],[187,3,187,5],[187,6,187,9],[188,3,188,5],[188,6,188,9],[189,3,189,5],[189,6,189,9],[183,3,183,5],[183,6,183,9],[184,3,184,5],[184,6,184,9],[185,3,185,5],[185,6,185,9],[179,3,179,5],[179,6,179,9],[180,3,180,5],[180,6,180,9],[182,3,182,5],[182,6,182,9],[173,3,173,5],[173,6,173,9],[177,3,177,5],[177,6,177,9],[178,3,178,5],[178,6,178,9],[170,3,170,5],[170,6,170,9],[171,3,171,5],[171,6,171,9],[172,3,172,5],[172,6,172,9],[166,3,166,5],[166,6,166,9],[167,3,167,5],[167,6,167,9],[168,3,168,5],[168,6,168,9],[162,3,162,5],[162,6,162,9],[163,3,163,5],[163,6,163,9],[165,3,165,5],[165,6,165,9],[156,3,156,5],[156,6,156,8],[160,3,160,5],[160,6,160,9],[161,3,161,5],[161,6,161,9],[153,3,153,5],[153,6,153,8],[154,3,154,5],[154,6,154,8],[155,3,155,5],[155,6,155,8],[145,3,145,4],[145,6,145,8],[146,13,147,15],[149,3,149,5],[149,6,149,8],[150,12,151,12],[119,3,119,5],[119,6,119,8],[120,3,120,5],[120,6,120,8],[121,3,121,5],[121,6,121,8],[116,3,116,5],[116,6,116,8],[117,3,117,5],[117,6,117,8],[118,3,118,5],[118,6,118,8],[112,3,112,5],[112,6,112,8],[113,3,113,5],[113,6,113,8],[114,3,114,5],[114,6,114,8],[109,3,109,5],[109,6,109,8],[110,3,110,5],[110,6,110,8],[111,3,111,5],[111,6,111,8],[105,3,105,5],[105,6,105,8],[106,3,106,5],[106,6,106,8],[107,3,107,5],[107,6,107,8],[102,3,102,5],[102,6,102,8],[103,3,103,5],[103,6,103,8],[104,3,104,5],[104,6,104,8],[96,3,96,5],[96,6,96,8],[97,3,97,5],[97,6,97,8],[98,3,98,5],[98,6,98,8],[93,3,93,5],[93,6,93,8],[94,3,94,5],[94,6,94,8],[95,3,95,5],[95,6,95,8],[89,3,89,5],[89,6,89,8],[90,3,90,5],[90,6,90,8],[91,3,91,5],[91,6,91,8],[86,3,86,5],[86,6,86,8],[87,3,87,5],[87,6,87,8],[88,3,88,5],[88,6,88,8],[82,3,82,5],[82,6,82,8],[83,3,83,5],[83,6,83,8],[84,3,84,5],[84,6,84,8],[79,3,79,5],[79,6,79,8],[80,3,80,5],[80,6,80,8],[81,3,81,5],[81,6,81,8],[73,3,73,5],[73,6,73,8],[74,3,74,5],[74,6,74,8],[75,3,75,5],[75,6,75,8],[70,3,70,5],[70,6,70,8],[71,3,71,5],[71,6,71,8],[72,3,72,5],[72,6,72,8],[66,3,66,5],[66,6,66,8],[67,3,67,5],[67,6,67,8],[68,3,68,5],[68,6,68,8],[63,3,63,5],[63,6,63,8],[64,3,64,5],[64,6,64,8],[65,3,65,5],[65,6,65,8],[59,3,59,5],[59,6,59,8],[60,3,60,5],[60,6,60,8],[61,3,61,5],[61,6,61,8],[56,3,56,5],[56,6,56,8],[57,3,57,5],[57,6,57,8],[58,3,58,5],[58,6,58,8],[50,3,50,5],[50,6,50,8],[51,3,51,5],[51,6,51,8],[52,3,52,5],[52,6,52,8],[47,3,47,5],[47,6,47,8],[48,3,48,5],[48,6,48,8],[49,3,49,5],[49,6,49,8],[43,3,43,5],[43,6,43,8],[44,3,44,5],[44,6,44,8],[45,3,45,5],[45,6,45,8],[40,3,40,5],[40,6,40,8],[41,3,41,5],[41,6,41,8],[42,3,42,5],[42,6,42,8],[36,3,36,5],[36,6,36,8],[37,3,37,5],[37,6,37,8],[38,3,38,5],[38,6,38,8],[33,3,33,5],[33,6,33,8],[34,3,34,5],[34,6,34,8],[35,3,35,5],[35,6,35,8],[26,3,26,5],[26,6,26,8],[28,3,28,5],[28,6,28,8],[29,3,29,5],[29,6,29,8],[18,3,18,5],[18,6,18,8],[19,3,19,5],[19,6,19,8],[25,3,25,5],[25,6,25,8],[12,3,12,5],[12,6,12,8],[13,3,13,5],[13,6,13,8],[14,3,14,5],[14,6,14,8],[5,2,5,4],[5,5,5,9],[7,3,7,4],[11,3,11,5],[11,6,11,8]]}
[null,"２．設備の概要（２枚目）"]
[null,"　※複数の型式を導入する場合は、それぞれの型式ごとにまとめること。"]
[]
[null,"（１）設備導入場所ごとの設備概要"]
[]
[null,null,"導入場所名称",null,null,{"$f":"'第4号.バイオマス発電'!E21","v":0}]
[]
[null,null,null,"発電総出力",null,null,{"$f":"IF(G37=\"\",0,ROUNDDOWN(SUM(G39,G46,G53),0))","v":0},"kW",null,null,null,null,"※発電出力10kW以上"]
[]
[]
[null,"（２）バイオマス発電設備"]
[null,null,null,"形態",null,null,null,null,null,null,null,null,"←プルダウンリストから選択してください"]
[null,null,null,"１日あたりの設備稼働時間",null,null,null,null,null,"ｈ/日"]
[null,null,null,"年間稼働日数",null,null,null,null,null,"日"]
[null,null,null,"年間稼働時間",null,null,{"$f":"IF(G13=\"\",\"\",ROUNDDOWN((G13*G14),2))","v":""},null,null,"ｈ/年"]
[]
[]
[null,"（３）バイオマス燃料"]
[null,null,null,"種類"]
[null,null,null,"バイオマス依存率（※）",null,null,{"$f":"'別紙１(1)_２枚目 '!$H$47","v":0},null,null,"％",null,null,"←別紙４を作成すると自動計算されます"]
[null,null,null,"※算定方法は、別紙3のとおり。",null,null,null,null,null,null,null,null,"※バイオマス依存率60％以上"]
[]
[]
[null,"（４）助成燃料等　（※使用する場合のみ記入）"]
[null,null,null,"スタートアップの場合"]
[null,null,null,"使用量",null,null,null,null,null,"ｔ/回"]
[null,null,null,"使用頻度",null,null,null,null,null,"回/年"]
[null,null,null,"その他"]
[null,null,null,"使用量",null,null,null,null,null,"ｔ/回"]
[null,null,null,"使用頻度",null,null,null,null,null,"回/年"]
[]
[]
[null,"（５）発電機"]
[null,null,"①","製造者名（メーカー名）"]
[null,null,null,"型式名"]
[null,null,null,"発電方式",null,null,null,null,null,null,null,null,"←プルダウンリストから選択してください"]
[null,null,null,"１台あたりの定格出力",null,null,null,null,null,"kW"]
[null,null,null,"台数",null,null,null,null,null,"台"]
[null,null,null,"定格出力合計",null,null,{"$f":"IF(G37=\"\",\"\",ROUNDDOWN(G37*G38,1))","v":""},null,null,"kW"]
[]
[null,null,"②","製造者名（メーカー名）"]
[null,null,null,"型式名"]
[null,null,null,"発電方式",null,null,null,null,null,null,null,null,"←プルダウンリストから選択してください"]
[null,null,null,"１台あたりの定格出力",null,null,null,null,null,"kW"]
[null,null,null,"台数",null,null,null,null,null,"台"]
[null,null,null,"定格出力合計",null,null,{"$f":"IF(G44=\"\",\"\",ROUNDDOWN(G44*G45,1))","v":""},null,null,"kW"]
[]
[null,null,"③","製造者名（メーカー名）"]
[null,null,null,"型式名"]
[null,null,null,"発電方式",null,null,null,null,null,null,null,null,"←プルダウンリストから選択してください"]
[null,null,null,"１台あたりの定格出力",null,null,null,null,null,"kW"]
[null,null,null,"台数",null,null,null,null,null,"台"]
[null,null,null,"定格出力合計",null,null,{"$f":"IF(G51=\"\",\"\",ROUNDDOWN(G51*G52,1))","v":""},null,null,"kW"]
[]
[]
[null,"（６）バイオマスボイラ-"]
[null,null,"①","製造者名（メーカー名）"]
[null,null,null,"型式名"]
[null,null,null,"機器の種類"]
[null,null,null,"１台あたりの能力",null,null,null,null,null,"kW"]
[null,null,null,"台数",null,null,null,null,null,"台"]
[null,null,null,"能力合計",null,null,{"$f":"IF(G60=\"\",\"\",ROUNDDOWN(G60*G61,2))","v":""},null,null,"kW"]
[]
[null,null,"②","製造者名（メーカー名）"]
[null,null,null,"型式名"]
[null,null,null,"機器の種類"]
[null,null,null,"１台あたりの能力",null,null,null,null,null,"kW"]
[null,null,null,"台数",null,null,null,null,null,"台"]
[null,null,null,"能力合計",null,null,{"$f":"IF(G67=\"\",\"\",ROUNDDOWN(G67*G68,2))","v":""},null,null,"kW"]
[]
[null,null,"③","製造者名（メーカー名）"]
[null,null,null,"型式名"]
[null,null,null,"機器の種類"]
[null,null,null,"１台あたりの能力",null,null,null,null,null,"kW"]
[null,null,null,"台数",null,null,null,null,null,"台"]
[null,null,null,"能力合計",null,null,{"$f":"IF(G74=\"\",\"\",ROUNDDOWN(G74*G75,2))","v":""},null,null,"kW"]
[]
[]
[null,"（７）バイオマス受入・供給設備　（※設置する場合のみ記入）"]
[null,null,"①","製造者名（メーカー名）"]
[null,null,null,"型式名"]
[null,null,null,"機器の種類"]
[null,null,null,"１基あたりの容量",null,null,null,null,null,"ｍ3"]
[null,null,null,"台数",null,null,null,null,null,"基"]
[null,null,null,"容量合計",null,null,{"$f":"IF(G83=\"\",\"\",ROUNDDOWN(G83*G84,2))","v":""},null,null,"ｍ3"]
[]
[null,null,"②","製造者名（メーカー名）"]
[null,null,null,"型式名"]
[null,null,null,"機器の種類"]
[null,null,null,"１基あたりの容量",null,null,null,null,null,"ｍ3"]
[null,null,null,"台数",null,null,null,null,null,"基"]
[null,null,null,"容量合計",null,null,{"$f":"IF(G90=\"\",\"\",ROUNDDOWN(G90*G91,2))","v":""},null,null,"ｍ3"]
[]
[null,null,"③","製造者名（メーカー名）"]
[null,null,null,"型式名"]
[null,null,null,"機器の種類"]
[null,null,null,"１基あたりの容量",null,null,null,null,null,"ｍ3"]
[null,null,null,"台数",null,null,null,null,null,"基"]
[null,null,null,"容量合計",null,null,{"$f":"IF(G97=\"\",\"\",ROUNDDOWN(G97*G98,2))","v":""},null,null,"ｍ3"]
[]
[]
[null,"（８）冷却塔　（※設置する場合のみ記入）"]
[null,null,"①","製造者名（メーカー名）"]
[null,null,null,"型式名"]
[null,null,null,"機器の種類"]
[null,null,null,"１台あたりの能力",null,null,null,null,null,"kW"]
[null,null,null,"台数",null,null,null,null,null,"台"]
[null,null,null,"能力合計",null,null,{"$f":"IF(G106=\"\",\"\",ROUNDDOWN(G106*G107,2))","v":""},null,null,"kW"]
[]
[null,null,"②","製造者名（メーカー名）"]
[null,null,null,"型式名"]
[null,null,null,"機器の種類"]
[null,null,null,"１台あたりの能力",null,null,null,null,null,"kW"]
[null,null,null,"台数",null,null,null,null,null,"台"]
[null,null,null,"能力合計",null,null,{"$f":"IF(G113=\"\",\"\",ROUNDDOWN(G113*G114,2))","v":""},null,null,"kW"]
[]
[null,null,"③","製造者名（メーカー名）"]
[null,null,null,"型式名"]
[null,null,null,"機器の種類"]
[null,null,null,"１台あたりの能力",null,null,null,null,null,"kW"]
[null,null,null,"台数",null,null,null,null,null,"台"]
[null,null,null,"能力合計",null,null,{"$f":"IF(G120=\"\",\"\",ROUNDDOWN(G120*G121,2))","v":""},null,null,"kW"]
[]
[]
[null,null,"［添付資料］"]
[null,null,"・","主要設備のカタログ、パンフレット等",null,null,"（添付資料７）"]
[null,null,"・","システム系統図",null,null,"（添付資料８）"]
[null,null,"・","単線結線図",null,null,"（添付資料９）"]
[null,null,"・","機器配置図",null,null,"（添付資料10）"]
[null,null,"・","バイオマスの調達に係る資料",null,null,"（添付資料14）"]
[null,null,"・","灰の処分に係る資料",null,null,"（添付資料15）"]
[null,null,"・","低位発熱量を証明する資料",null,null,"（添付資料16）"]
[]
[]
[]
[]
[]
[]
[]
[]
[]
[]
[]
[null,"※バイオマス燃料製造を実施する場合のみ"]
[null,"（９）バイオマス燃料製造方式"]
[null,null,null,"形態　　：",null,null,"メタン発酵方式",null,null,null,null,null,"←プルダウンリストから選択してください"]
[null,null,null,null,null,null,null,null,null,null,null,null,null,"１．メタン発酵方式"]
[]
[null,"（10）製造時のバイオマス依存率",null,null,null,null,null,null,null,null,null,null,null,"　・ガス製造量：100 N㎥／日 以上"]
[null,null,null,"バイオマス依存率",null,null,{"$f":"'別紙１(2)_２枚目 '!$H$47","v":0},null,null,"％",null,null,"←別紙４を作成すると自動計算される","　・低位発熱量：18.84 MJ／N㎥（4,500kcal／N ㎥）以上"]
[null,null,null,null,null,null,null,null,null,null,null,null,"※バイオマス依存率60％以上"]
[]
[null,"（11）製造するバイオマス燃料",null,null,null,null,null,null,null,null,null,null,null,"２．メタン発酵方式以外"]
[null,null,null,"名称",null,null,null,null,null,null,null,null,null,"　・製造量：固形化 150kg／日 以上"]
[null,null,null,"形態",null,null,null,null,null,null,null,null,"←プルダウンリストから選択してください","　　　　　　　液 化 100kg／日 以上"]
[null,null,null,"製造量",null,null,null,null,null,{"$f":"IF(G155<>\"気体\",\"kg/日\",\"N㎥/日\")","v":"kg/日"},null,null,null,"　　　　　　　ガス化 450N㎥／日 以上"]
[null,null,null,"低位発熱量",null,null,null,null,null,{"$f":"IF(G155<>\"気体\",\"MJ/kg\",\"MJ/N㎥\")","v":"MJ/kg"},null,null,null,"（ただし、離島及びへき地は、上記要件を除く。）"]
[]
[]
[null,"（12）バイオマス燃料製造設備"]
[null,null,"①","製造者名（メーカー名）"]
[null,null,null,"型式名"]
[null,null,null,"機器の種類"]
[null,null,null,"能力・容量"]
[]
[null,null,"②","製造者名（メーカー名）"]
[null,null,null,"型式名"]
[null,null,null,"機器の種類"]
[null,null,null,"能力・容量"]
[]
[null,null,"③","製造者名（メーカー名）"]
[null,null,null,"型式名"]
[null,null,null,"機器の種類"]
[null,null,null,"能力・容量"]
[]
[]
[null,"（13）バイオマス原料受入・供給設備"]
[null,null,"①","製造者名（メーカー名）"]
[null,null,null,"型式名"]
[null,null,null,"機器の種類"]
[null,null,null,"能力・容量"]
[]
[null,null,"②","製造者名（メーカー名）"]
[null,null,null,"型式名"]
[null,null,null,"機器の種類"]
[null,null,null,"能力・容量"]
[]
[null,null,"③","製造者名（メーカー名）"]
[null,null,null,"型式名"]
[null,null,null,"機器の種類"]
[null,null,null,"能力・容量"]
[]
[]
[]
[]
[]
[]
[]
[]
[]
[]
[]
[]
[null,"（14）バイオマス燃料貯蔵設備"]
[null,null,"①","製造者名（メーカー名）"]
[null,null,null,"型式名"]
[null,null,null,"機器の種類"]
[null,null,null,"能力・容量"]
[]
[null,null,"②","製造者名（メーカー名）"]
[null,null,null,"型式名"]
[null,null,null,"機器の種類"]
[null,null,null,"能力・容量"]
[]
[null,null,"③","製造者名（メーカー名）"]
[null,null,null,"型式名"]
[null,null,null,"機器の種類"]
[null,null,null,"能力・容量"]
[]
[]
[null,"（15）前処理設備"]
[null,null,"①","製造者名（メーカー名）"]
[null,null,null,"型式名"]
[null,null,null,"機器の種類"]
[null,null,null,"能力・容量"]
[]
[null,null,"②","製造者名（メーカー名）"]
[null,null,null,"型式名"]
[null,null,null,"機器の種類"]
[null,null,null,"能力・容量"]
[]
[null,null,"③","製造者名（メーカー名）"]
[null,null,null,"型式名"]
[null,null,null,"機器の種類"]
[null,null,null,"能力・容量"]
[]
[]
[null,"（16）後処理設備"]
[null,null,"①","製造者名（メーカー名）"]
[null,null,null,"型式名"]
[null,null,null,"機器の種類"]
[null,null,null,"能力・容量"]
[]
[null,null,"②","製造者名（メーカー名）"]
[null,null,null,"型式名"]
[null,null,null,"機器の種類"]
[null,null,null,"能力・容量"]
[]
[null,null,"③","製造者名（メーカー名）"]
[null,null,null,"型式名"]
[null,null,null,"機器の種類"]
[null,null,null,"能力・容量"]
[]
[]
[null,"※バイオマス燃料製造を実施する場合のみ"]
[null,"・利用計画及び生産計画"]
[null,null,null,null,null,null,null,"（単位：",{"$f":"IF(G169<>\"気体\",\"kg\",\"N㎥\")","v":"kg"},"/年）"]
[null,"年次",null,"年間生産量","バイオマス燃料年間利用量"]
[null,null,null,null,null,null,null,null,null,"合計"]
[null,"1年目",null,null,null,null,null,null,null,{"$f":"SUM(E260:I260)","v":0}]
[null,"2年目",null,null,null,null,null,null,null,0]
[null,"3年目",null,null,null,null,null,null,null,0]
[null,"4年目",null,null,null,null,null,null,null,0]
[null,"5年目",null,null,null,null,null,null,null,0]
[null,"6年目",null,null,null,null,null,null,null,0]
[null,"7年目",null,null,null,null,null,null,null,0]
[null,"8年目",null,null,null,null,null,null,null,0]
[null,"9年目",null,null,null,null,null,null,null,0]
[null,"10年目",null,null,null,null,null,null,null,0]
[null,"11年目",null,null,null,null,null,null,null,0]
[null,"12年目",null,null,null,null,null,null,null,0]
[null,"13年目",null,null,null,null,null,null,null,0]
[null,"14年目",null,null,null,null,null,null,null,0]
[null,"15年目",null,null,null,null,null,null,null,0]
[]
[null,null,"年間最大生産量",null,null,{"$f":"MAX(D260:D274)","v":0}]
[]
[null,null,"年間最大利用量",null,null,{"$f":"MAX(J260:J274)","v":0}]
[]
[null,null,"設備利用率",null,null,{"$f":"IF(D260=\"\",\"\",F278/F276*100)","v":""},null,"％"]
[]
[null,"［添付資料］"]
[null,null,"・バイオマス燃料利用計画",null,null,null,null,"（添付資料17）"]
[null,null,"・バイオマス燃料製造計画",null,null,null,null,"（添付資料18）"]

{"sheet":"別紙１(1)_２枚目 ","index":14,"n_rows":49,"n_cols":13,"rows_kept":49,"cut":false,"hidden":false,"merged":[[46,7,46,8],[35,2,38,2],[35,7,35,9],[36,7,36,9],[37,7,37,9],[38,7,38,9],[39,2,40,2],[39,7,39,9],[40,7,40,9],[41,7,42,7],[41,8,42,9],[42,2,42,3],[45,1,45,3],[45,6,45,9],[21,1,40,1],[23,7,23,9],[26,7,26,9],[27,7,27,9],[29,7,29,9],[30,7,30,9],[31,7,31,9],[32,7,32,9],[33,2,34,2],[33,7,33,9],[34,7,34,9],[12,7,12,9],[13,7,13,9],[21,2,22,3],[21,7,21,9],[22,7,22,9],[23,2,32,2],[28,7,28,9],[16,2,18,2],[16,7,16,9],[17,7,17,9],[18,7,18,9],[19,8,19,9],[24,7,24,9],[25,7,25,9],[14,2,15,2],[14,7,14,9],[15,7,15,9],[2,1,2,9],[4,1,18,1],[4,2,5,3],[4,7,4,9],[5,7,5,9],[6,2,8,2],[6,7,6,9],[7,7,7,9],[8,7,8,9],[9,2,13,2],[9,7,9,9],[10,7,10,9],[11,7,11,9]]}
[null,"第４号様式：別紙１（１）（２枚目）"]
[]
[null,"バイオマス依存率計算書（バイオマス発電）"]
[]
[null,"バイオマス燃料","種類",null,"構成比","Ａ．バイオマス\n（燃料）利用量","Ｂ．バイオマス\n（燃料）低位発熱量","バイオマス\n（燃料）発熱量"]
[null,null,null,null,"％","kg/h",{"$f":"IF(F6=\"kg/h\",\"MJ/kg\",\"MJ/N㎥\")","v":"MJ/kg"},"MJ/h",null,null,null,null,"←利用量の単位は、プルダウンリストから選択してください"]
[null,null,"紙くず","紙類",{"$f":"IFERROR(F7/SUM($F$7:$F$19,$F$24:$F$41)*100,\"\")","v":""},null,null,{"$f":"F7*G7","v":0}]
[null,null,null,"新聞紙",{"$f":"IFERROR(F8/SUM($F$7:$F$19,$F$24:$F$41)*100,\"\")","v":""},null,null,{"$f":"F8*G8","v":0}]
[null,null,null,"紙管","",null,null,0]
[null,null,"木くず","草・木","",null,null,0]
[null,null,null,"おがくず",{"$f":"IFERROR(F11/SUM($F$7:$F$19,$F$24:$F$41)*100,\"\")","v":""},null,null,0]
[null,null,null,"木片","",null,null,0]
[null,null,null,"ベニア・合板・化粧版","",null,null,0]
[null,null,null,"集成材・ボード","",null,null,0]
[null,null,"繊維くず","木綿","",null,null,0]
[null,null,null,"羊毛","",null,null,0]
[null,null,"その他","一般雑芥","",null,null,0]
[null,null,null,"廃油(動植物系)","",null,null,0]
[null,null,null,"その他","",null,null,0]
[null,null,null,null,null,null,null,"①",{"$f":"SUM(H7:J19)","v":0}]
[]
[null,"非バイオマス燃料","種類",null,"構成比","Ｃ．非バイオマス\n（燃料）利用量","Ｄ．非バイオマス\n（燃料）低位発熱量","非バイオマス\n（燃料）発熱量"]
[null,null,null,null,"％",{"$f":"F6","v":"kg/h"},{"$f":"G6","v":"MJ/kg"},"MJ/h"]
[null,null,"廃プラスチック類","ポリエチレン（ＰＥ）",{"$f":"IFERROR(F24/SUM($F$7:$F$19,$F$24:$F$41)*100,\"\")","v":""},null,null,{"$f":"F24*G24","v":0}]
[null,null,null,"ポリプロピレン（ＰＰ）",{"$f":"IFERROR(F25/SUM($F$7:$F$19,$F$24:$F$41)*100,\"\")","v":""},null,null,0]
[null,null,null,"ポリスチレン（ＰＳ）",{"$f":"IFERROR(F26/SUM($F$7:$F$19,$F$24:$F$41)*100,\"\")","v":""},null,null,{"$f":"F26*G26","v":0}]
[null,null,null,"発泡スチロール","",null,null,0]
[null,null,null,"ＦＲＰ樹脂","",null,null,0]
[null,null,null,"フェノール樹脂","",null,null,0]
[null,null,null,"熱可塑性樹脂","",null,null,0]
[null,null,null,"混合樹脂製品","",null,null,0]
[null,null,null,"ＰＥＴボトル","",null,null,0]
[null,null,null,"皮製品","",null,null,0]
[null,null,"ゴムくず","タイヤ","",null,null,0]
[null,null,null,"合成ゴム","",null,null,0]
[null,null,"繊維くず","ナイロン布","",null,null,0]
[null,null,null,"アクリル布","",null,null,0]
[null,null,null,"ビニロン布","",null,null,0]
[null,null,null,"ポリエステル布","",null,null,0]
[null,null,"その他","廃油（石油系）","",null,null,0]
[null,null,null,"その他","",null,null,0]
[null,null,null,null,null,null,null,"②",{"$f":"SUM(H24:J41)","v":0}]
[null,null,"構成比の合計",null,{"$f":"SUM(E7:E19,E24:E41)","v":0}]
[]
[]
[null,"バイオマス依存率＝",null,null,null,null,"×100＝ ①/（①+②）×100"]
[null,null,null,null,null,null,"＝",{"$f":"IF(I20=0,0,I20/(I20+I42)*100)","v":0},null,"％",null,null,"※バイオマス依存率60％以上"]
[]
[null,null,"・バイオマス排水、家畜糞尿、食品残渣等を原料にする場合は、バイオマス依存率を１００％とする。"]

{"sheet":"別紙１(2)_２枚目 ","index":15,"n_rows":50,"n_cols":13,"rows_kept":50,"cut":false,"hidden":false,"merged":[[46,7,46,8],[35,2,38,2],[35,7,35,9],[36,7,36,9],[37,7,37,9],[38,7,38,9],[39,2,40,2],[39,7,39,9],[40,7,40,9],[41,7,42,7],[41,8,42,9],[42,2,42,3],[45,1,45,3],[45,6,45,9],[21,1,40,1],[23,7,23,9],[26,7,26,9],[27,7,27,9],[29,7,29,9],[30,7,30,9],[31,7,31,9],[32,7,32,9],[33,2,34,2],[33,7,33,9],[34,7,34,9],[12,7,12,9],[13,7,13,9],[21,2,22,3],[21,7,21,9],[22,7,22,9],[23,2,32,2],[28,7,28,9],[16,2,18,2],[16,7,16,9],[17,7,17,9],[18,7,18,9],[19,8,19,9],[24,7,24,9],[25,7,25,9],[14,2,15,2],[14,7,14,9],[15,7,15,9],[2,1,2,9],[4,1,18,1],[4,2,5,3],[4,7,4,9],[5,7,5,9],[6,2,8,2],[6,7,6,9],[7,7,7,9],[8,7,8,9],[9,2,13,2],[9,7,9,9],[10,7,10,9],[11,7,11,9]]}
[null,"第４号様式：別紙１（２）（２枚目）"]
[]
[null,"バイオマス依存率計算書（バイオマス燃料製造）"]
[]
[null,"バイオマス燃料","種類",null,"構成比","Ａ．バイオマス\n（原料）利用量","Ｂ．バイオマス\n（原料）低位発熱量","バイオマス\n（原料）発熱量"]
[null,null,null,null,"％","kg/h",{"$f":"IF(F6=\"kg/h\",\"MJ/kg\",\"MJ/N㎥\")","v":"MJ/kg"},"MJ/h",null,null,null,null,"←利用量の単位は、プルダウンリストから選択してください"]
[null,null,"紙くず","紙類",{"$f":"IFERROR(F7/SUM($F$7:$F$19,$F$24:$F$41)*100,\"\")","v":""},null,null,{"$f":"F7*G7","v":0}]
[null,null,null,"新聞紙",{"$f":"IFERROR(F8/SUM($F$7:$F$19,$F$24:$F$41)*100,\"\")","v":""},null,null,{"$f":"F8*G8","v":0}]
[null,null,null,"紙管","",null,null,0]
[null,null,"木くず","草・木","",null,null,0]
[null,null,null,"おがくず","",null,null,0]
[null,null,null,"木片","",null,null,0]
[null,null,null,"ベニア・合板・化粧版","",null,null,0]
[null,null,null,"集成材・ボード","",null,null,0]
[null,null,"繊維くず","木綿","",null,null,0]
[null,null,null,"羊毛","",null,null,0]
[null,null,"その他","一般雑芥","",null,null,0]
[null,null,null,"廃油(動植物系)","",null,null,0]
[null,null,null,"その他","",null,null,0]
[null,null,null,null,null,null,null,"①",{"$f":"SUM(H7:J19)","v":0}]
[]
[null,"非バイオマス燃料","種類",null,"構成比","Ｃ．非バイオマス\n（原料）利用量","Ｄ．非バイオマス\n（原料）低位発熱量","非バイオマス\n（原料）発熱量"]
[null,null,null,null,"％",{"$f":"F6","v":"kg/h"},{"$f":"G6","v":"MJ/kg"},"MJ/h"]
[null,null,"廃プラスチック類","ポリエチレン（ＰＥ）",{"$f":"IFERROR(F24/SUM($F$7:$F$19,$F$24:$F$41)*100,\"\")","v":""},null,null,{"$f":"F24*G24","v":0}]
[null,null,null,"ポリプロピレン（ＰＰ）","",null,null,0]
[null,null,null,"ポリスチレン（ＰＳ）","",null,null,0]
[null,null,null,"発泡スチロール","",null,null,0]
[null,null,null,"ＦＲＰ樹脂","",null,null,0]
[null,null,null,"フェノール樹脂","",null,null,0]
[null,null,null,"熱可塑性樹脂","",null,null,0]
[null,null,null,"混合樹脂製品","",null,null,0]
[null,null,null,"ＰＥＴボトル","",null,null,0]
[null,null,null,"皮製品","",null,null,0]
[null,null,"ゴムくず","タイヤ","",null,null,0]
[null,null,null,"合成ゴム","",null,null,0]
[null,null,"繊維くず","ナイロン布","",null,null,0]
[null,null,null,"アクリル布","",null,null,0]
[null,null,null,"ビニロン布","",null,null,0]
[null,null,null,"ポリエステル布","",null,null,0]
[null,null,"その他","廃油（石油系）","",null,null,0]
[null,null,null,"その他","",null,null,0]
[null,null,null,null,null,null,null,"②",{"$f":"SUM(H24:J41)","v":0}]
[null,null,"構成比の合計",null,{"$f":"SUM(E7:E19,E24:E41)","v":0}]
[]
[]
[null,"バイオマス依存率＝",null,null,null,null,"×100＝ ①/（①+②）×100"]
[null,null,null,null,null,null,"＝",{"$f":"IF(I20=0,0,I20/(I20+I42)*100)","v":0},null,"％",null,null,"※バイオマス依存率60％以上"]
[]
[null,null,"・バイオマス排水、家畜糞尿、食品残渣等を原料にする場合は、バイオマス依存率を１００％とする。"]
[null,null,"・メタン発酵方式の場合は、発酵槽へ投じられるものをバイオマス原料とする。"]

{"sheet":"第4号.バイオマス発電設備の概要_３枚目","index":16,"n_rows":284,"n_cols":14,"rows_kept":284,"cut":false,"hidden":false,"merged":[[275,5,275,6],[277,5,277,6],[279,5,279,6],[268,1,268,2],[269,1,269,2],[270,1,270,2],[271,1,271,2],[272,1,272,2],[273,1,273,2],[262,1,262,2],[263,1,263,2],[264,1,264,2],[265,1,265,2],[266,1,266,2],[267,1,267,2],[257,1,258,2],[257,3,258,3],[257,4,257,9],[259,1,259,2],[260,1,260,2],[261,1,261,2],[249,3,249,5],[249,6,249,9],[250,3,250,5],[250,6,250,9],[251,3,251,5],[251,6,251,9],[245,3,245,5],[245,6,245,9],[246,3,246,5],[246,6,246,9],[248,3,248,5],[248,6,248,9],[241,3,241,5],[241,6,241,9],[243,3,243,5],[243,6,243,9],[244,3,244,5],[244,6,244,9],[238,3,238,5],[238,6,238,9],[239,3,239,5],[239,6,239,9],[240,3,240,5],[240,6,240,9],[232,3,232,5],[232,6,232,9],[233,3,233,5],[233,6,233,9],[234,3,234,5],[234,6,234,9],[228,3,228,5],[228,6,228,9],[229,3,229,5],[229,6,229,9],[231,3,231,5],[231,6,231,9],[224,3,224,5],[224,6,224,9],[226,3,226,5],[226,6,226,9],[227,3,227,5],[227,6,227,9],[221,3,221,5],[221,6,221,9],[222,3,222,5],[222,6,222,9],[223,3,223,5],[223,6,223,9],[215,3,215,5],[215,6,215,9],[216,3,216,5],[216,6,216,9],[217,3,217,5],[217,6,217,9],[211,3,211,5],[211,6,211,9],[212,3,212,5],[212,6,212,9],[214,3,214,5],[214,6,214,9],[207,3,207,5],[207,6,207,9],[209,3,209,5],[209,6,209,9],[210,3,210,5],[210,6,210,9],[204,3,204,5],[204,6,204,9],[205,3,205,5],[205,6,205,9],[206,3,206,5],[206,6,206,9],[188,3,188,5],[188,6,188,9],[189,3,189,5],[189,6,189,9],[190,3,190,5],[190,6,190,9],[184,3,184,5],[184,6,184,9],[185,3,185,5],[185,6,185,9],[187,3,187,5],[187,6,187,9],[180,3,180,5],[180,6,180,9],[182,3,182,5],[182,6,182,9],[183,3,183,5],[183,6,183,9],[177,3,177,5],[177,6,177,9],[178,3,178,5],[178,6,178,9],[179,3,179,5],[179,6,179,9],[171,3,171,5],[171,6,171,9],[172,3,172,5],[172,6,172,9],[173,3,173,5],[173,6,173,9],[167,3,167,5],[167,6,167,9],[168,3,168,5],[168,6,168,9],[170,3,170,5],[170,6,170,9],[163,3,163,5],[163,6,163,9],[165,3,165,5],[165,6,165,9],[166,3,166,5],[166,6,166,9],[160,3,160,5],[160,6,160,9],[161,3,161,5],[161,6,161,9],[162,3,162,5],[162,6,162,9],[154,3,154,5],[154,6,154,8],[155,3,155,5],[155,6,155,8],[156,3,156,5],[156,6,156,8],[146,13,147,15],[149,3,149,5],[149,6,149,8],[150,12,151,12],[153,3,153,5],[153,6,153,8],[120,3,120,5],[120,6,120,8],[121,3,121,5],[121,6,121,8],[145,3,145,4],[145,6,145,8],[117,3,117,5],[117,6,117,8],[118,3,118,5],[118,6,118,8],[119,3,119,5],[119,6,119,8],[113,3,113,5],[113,6,113,8],[114,3,114,5],[114,6,114,8],[116,3,116,5],[116,6,116,8],[110,3,110,5],[110,6,110,8],[111,3,111,5],[111,6,111,8],[112,3,112,5],[112,6,112,8],[106,3,106,5],[106,6,106,8],[107,3,107,5],[107,6,107,8],[109,3,109,5],[109,6,109,8],[103,3,103,5],[103,6,103,8],[104,3,104,5],[104,6,104,8],[105,3,105,5],[105,6,105,8],[97,3,97,5],[97,6,97,8],[98,3,98,5],[98,6,98,8],[102,3,102,5],[102,6,102,8],[94,3,94,5],[94,6,94,8],[95,3,95,5],[95,6,95,8],[96,3,96,5],[96,6,96,8],[90,3,90,5],[90,6,90,8],[91,3,91,5],[91,6,91,8],[93,3,93,5],[93,6,93,8],[87,3,87,5],[87,6,87,8],[88,3,88,5],[88,6,88,8],[89,3,89,5],[89,6,89,8],[83,3,83,5],[83,6,83,8],[84,3,84,5],[84,6,84,8],[86,3,86,5],[86,6,86,8],[80,3,80,5],[80,6,80,8],[81,3,81,5],[81,6,81,8],[82,3,82,5],[82,6,82,8],[74,3,74,5],[74,6,74,8],[75,3,75,5],[75,6,75,8],[79,3,79,5],[79,6,79,8],[71,3,71,5],[71,6,71,8],[72,3,72,5],[72,6,72,8],[73,3,73,5],[73,6,73,8],[67,3,67,5],[67,6,67,8],[68,3,68,5],[68,6,68,8],[70,3,70,5],[70,6,70,8],[64,3,64,5],[64,6,64,8],[65,3,65,5],[65,6,65,8],[66,3,66,5],[66,6,66,8],[60,3,60,5],[60,6,60,8],[61,3,61,5],[61,6,61,8],[63,3,63,5],[63,6,63,8],[57,3,57,5],[57,6,57,8],[58,3,58,5],[58,6,58,8],[59,3,59,5],[59,6,59,8],[51,3,51,5],[51,6,51,8],[52,3,52,5],[52,6,52,8],[56,3,56,5],[56,6,56,8],[48,3,48,5],[48,6,48,8],[49,3,49,5],[49,6,49,8],[50,3,50,5],[50,6,50,8],[44,3,44,5],[44,6,44,8],[45,3,45,5],[45,6,45,8],[47,3,47,5],[47,6,47,8],[41,3,41,5],[41,6,41,8],[42,3,42,5],[42,6,42,8],[43,3,43,5],[43,6,43,8],[37,3,37,5],[37,6,37,8],[38,3,38,5],[38,6,38,8],[40,3,40,5],[40,6,40,8],[34,3,34,5],[34,6,34,8],[35,3,35,5],[35,6,35,8],[36,3,36,5],[36,6,36,8],[28,3,28,5],[28,6,28,8],[29,3,29,5],[29,6,29,8],[33,3,33,5],[33,6,33,8],[19,3,19,5],[19,6,19,8],[25,3,25,5],[25,6,25,8],[26,3,26,5],[26,6,26,8],[13,3,13,5],[13,6,13,8],[14,3,14,5],[14,6,14,8],[18,3,18,5],[18,6,18,8],[5,2,5,4],[5,5,5,9],[7,3,7,4],[11,3,11,5],[11,6,11,8],[12,3,12,5],[12,6,12,8]]}
[null,"２．設備の概要（３枚目）"]
[null,"　※複数の型式を導入する場合は、それぞれの型式ごとにまとめること。"]
[]
[null,"（１）設備導入場所ごとの設備概要"]
[]
[null,null,"導入場所名称",null,null,{"$f":"'第4号.バイオマス発電'!E27","v":0}]
[]
[null,null,null,"発電総出力",null,null,{"$f":"IF(G37=\"\",0,ROUNDDOWN(SUM(G39,G46,G53),0))","v":0},"kW",null,null,null,null,"※発電出力10kW以上"]
[]
[]
[null,"（２）バイオマス発電設備"]
[null,null,null,"形態",null,null,null,null,null,null,null,null,"←プルダウンリストから選択してください"]
[null,null,null,"１日あたりの設備稼働時間",null,null,null,null,null,"ｈ/日"]
[null,null,null,"年間稼働日数",null,null,null,null,null,"日"]
[null,null,null,"年間稼働時間",null,null,{"$f":"IF(G13=\"\",\"\",ROUNDDOWN((G13*G14),2))","v":""},null,null,"ｈ/年"]
[]
[]
[null,"（３）バイオマス燃料"]
[null,null,null,"種類"]
[null,null,null,"バイオマス依存率（※）",null,null,{"$f":"'別紙１(1)_３枚目'!$H$47","v":0},null,null,"％",null,null,"←別紙４を作成すると自動計算されます"]
[null,null,null,"※算定方法は、別紙3のとおり。",null,null,null,null,null,null,null,null,"※バイオマス依存率60％以上"]
[]
[]
[null,"（４）助成燃料等　（※使用する場合のみ記入）"]
[null,null,null,"スタートアップの場合"]
[null,null,null,"使用量",null,null,null,null,null,"ｔ/回"]
[null,null,null,"使用頻度",null,null,null,null,null,"回/年"]
[null,null,null,"その他"]
[null,null,null,"使用量",null,null,null,null,null,"ｔ/回"]
[null,null,null,"使用頻度",null,null,null,null,null,"回/年"]
[]
[]
[null,"（５）発電機"]
[null,null,"①","製造者名（メーカー名）"]
[null,null,null,"型式名"]
[null,null,null,"発電方式",null,null,null,null,null,null,null,null,"←プルダウンリストから選択してください"]
[null,null,null,"１台あたりの定格出力",null,null,null,null,null,"kW"]
[null,null,null,"台数",null,null,null,null,null,"台"]
[null,null,null,"定格出力合計",null,null,{"$f":"IF(G37=\"\",\"\",ROUNDDOWN(G37*G38,1))","v":""},null,null,"kW"]
[]
[null,null,"②","製造者名（メーカー名）"]
[null,null,null,"型式名"]
[null,null,null,"発電方式",null,null,null,null,null,null,null,null,"←プルダウンリストから選択してください"]
[null,null,null,"１台あたりの定格出力",null,null,null,null,null,"kW"]
[null,null,null,"台数",null,null,null,null,null,"台"]
[null,null,null,"定格出力合計",null,null,{"$f":"IF(G44=\"\",\"\",ROUNDDOWN(G44*G45,1))","v":""},null,null,"kW"]
[]
[null,null,"③","製造者名（メーカー名）"]
[null,null,null,"型式名"]
[null,null,null,"発電方式",null,null,null,null,null,null,null,null,"←プルダウンリストから選択してください"]
[null,null,null,"１台あたりの定格出力",null,null,null,null,null,"kW"]
[null,null,null,"台数",null,null,null,null,null,"台"]
[null,null,null,"定格出力合計",null,null,{"$f":"IF(G51=\"\",\"\",ROUNDDOWN(G51*G52,1))","v":""},null,null,"kW"]
[]
[]
[null,"（６）バイオマスボイラ-"]
[null,null,"①","製造者名（メーカー名）"]
[null,null,null,"型式名"]
[null,null,null,"機器の種類"]
[null,null,null,"１台あたりの能力",null,null,null,null,null,"kW"]
[null,null,null,"台数",null,null,null,null,null,"台"]
[null,null,null,"能力合計",null,null,{"$f":"IF(G60=\"\",\"\",ROUNDDOWN(G60*G61,2))","v":""},null,null,"kW"]
[]
[null,null,"②","製造者名（メーカー名）"]
[null,null,null,"型式名"]
[null,null,null,"機器の種類"]
[null,null,null,"１台あたりの能力",null,null,null,null,null,"kW"]
[null,null,null,"台数",null,null,null,null,null,"台"]
[null,null,null,"能力合計",null,null,{"$f":"IF(G67=\"\",\"\",ROUNDDOWN(G67*G68,2))","v":""},null,null,"kW"]
[]
[null,null,"③","製造者名（メーカー名）"]
[null,null,null,"型式名"]
[null,null,null,"機器の種類"]
[null,null,null,"１台あたりの能力",null,null,null,null,null,"kW"]
[null,null,null,"台数",null,null,null,null,null,"台"]
[null,null,null,"能力合計",null,null,{"$f":"IF(G74=\"\",\"\",ROUNDDOWN(G74*G75,2))","v":""},null,null,"kW"]
[]
[]
[null,"（７）バイオマス受入・供給設備　（※設置する場合のみ記入）"]
[null,null,"①","製造者名（メーカー名）"]
[null,null,null,"型式名"]
[null,null,null,"機器の種類"]
[null,null,null,"１基あたりの容量",null,null,null,null,null,"ｍ3"]
[null,null,null,"台数",null,null,null,null,null,"基"]
[null,null,null,"容量合計",null,null,{"$f":"IF(G83=\"\",\"\",ROUNDDOWN(G83*G84,2))","v":""},null,null,"ｍ3"]
[]
[null,null,"②","製造者名（メーカー名）"]
[null,null,null,"型式名"]
[null,null,null,"機器の種類"]
[null,null,null,"１基あたりの容量",null,null,null,null,null,"ｍ3"]
[null,null,null,"台数",null,null,null,null,null,"基"]
[null,null,null,"容量合計",null,null,{"$f":"IF(G90=\"\",\"\",ROUNDDOWN(G90*G91,2))","v":""},null,null,"ｍ3"]
[]
[null,null,"③","製造者名（メーカー名）"]
[null,null,null,"型式名"]
[null,null,null,"機器の種類"]
[null,null,null,"１基あたりの容量",null,null,null,null,null,"ｍ3"]
[null,null,null,"台数",null,null,null,null,null,"基"]
[null,null,null,"容量合計",null,null,{"$f":"IF(G97=\"\",\"\",ROUNDDOWN(G97*G98,2))","v":""},null,null,"ｍ3"]
[]
[]
[null,"（８）冷却塔　（※設置する場合のみ記入）"]
[null,null,"①","製造者名（メーカー名）"]
[null,null,null,"型式名"]
[null,null,null,"機器の種類"]
[null,null,null,"１台あたりの能力",null,null,null,null,null,"kW"]
[null,null,null,"台数",null,null,null,null,null,"台"]
[null,null,null,"能力合計",null,null,{"$f":"IF(G106=\"\",\"\",ROUNDDOWN(G106*G107,2))","v":""},null,null,"kW"]
[]
[null,null,"②","製造者名（メーカー名）"]
[null,null,null,"型式名"]
[null,null,null,"機器の種類"]
[null,null,null,"１台あたりの能力",null,null,null,null,null,"kW"]
[null,null,null,"台数",null,null,null,null,null,"台"]
[null,null,null,"能力合計",null,null,{"$f":"IF(G113=\"\",\"\",ROUNDDOWN(G113*G114,2))","v":""},null,null,"kW"]
[]
[null,null,"③","製造者名（メーカー名）"]
[null,null,null,"型式名"]
[null,null,null,"機器の種類"]
[null,null,null,"１台あたりの能力",null,null,null,null,null,"kW"]
[null,null,null,"台数",null,null,null,null,null,"台"]
[null,null,null,"能力合計",null,null,{"$f":"IF(G120=\"\",\"\",ROUNDDOWN(G120*G121,2))","v":""},null,null,"kW"]
[]
[]
[null,null,"［添付資料］"]
[null,null,"・","主要設備のカタログ、パンフレット等",null,null,"（添付資料７）"]
[null,null,"・","システム系統図",null,null,"（添付資料８）"]
[null,null,"・","単線結線図",null,null,"（添付資料９）"]
[null,null,"・","機器配置図",null,null,"（添付資料10）"]
[null,null,"・","バイオマスの調達に係る資料",null,null,"（添付資料14）"]
[null,null,"・","灰の処分に係る資料",null,null,"（添付資料15）"]
[null,null,"・","低位発熱量を証明する資料",null,null,"（添付資料16）"]
[]
[]
[]
[]
[]
[]
[]
[]
[]
[]
[]
[null,"※バイオマス燃料製造を実施する場合のみ"]
[null,"（10）バイオマス燃料製造方式"]
[null,null,null,"形態　　：",null,null,null,null,null,null,null,null,"←プルダウンリストから選択してください"]
[null,null,null,null,null,null,null,null,null,null,null,null,null,"１．メタン発酵方式"]
[]
[null,"（11）製造時のバイオマス依存率",null,null,null,null,null,null,null,null,null,null,null,"　・ガス製造量：100 N㎥／日 以上"]
[null,null,null,"バイオマス依存率",null,null,{"$f":"'別紙１(2)_３枚目'!$H$47","v":0},null,null,"％",null,null,"←別紙４を作成すると自動計算される","　・低位発熱量：18.84 MJ／N㎥（4,500kcal／N ㎥）以上"]
[null,null,null,null,null,null,null,null,null,null,null,null,"※バイオマス依存率60％以上"]
[]
[null,"（12）製造するバイオマス燃料",null,null,null,null,null,null,null,null,null,null,null,"２．メタン発酵方式以外"]
[null,null,null,"名称",null,null,null,null,null,null,null,null,null,"　・製造量：固形化 150kg／日 以上"]
[null,null,null,"形態",null,null,null,null,null,null,null,null,"←プルダウンリストから選択してください","　　　　　　　液 化 100kg／日 以上"]
[null,null,null,"製造量",null,null,null,null,null,{"$f":"IF(G155<>\"気体\",\"kg/日\",\"N㎥/日\")","v":"kg/日"},null,null,null,"　　　　　　　ガス化 450N㎥／日 以上"]
[null,null,null,"低位発熱量",null,null,null,null,null,{"$f":"IF(G155<>\"気体\",\"MJ/kg\",\"MJ/N㎥\")","v":"MJ/kg"},null,null,null,"（ただし、離島及びへき地は、上記要件を除く。）"]
[]
[]
[null,"（13）バイオマス燃料製造設備"]
[null,null,"①","製造者名（メーカー名）"]
[null,null,null,"型式名"]
[null,null,null,"機器の種類"]
[null,null,null,"能力・容量"]
[]
[null,null,"②","製造者名（メーカー名）"]
[null,null,null,"型式名"]
[null,null,null,"機器の種類"]
[null,null,null,"能力・容量"]
[]
[null,null,"③","製造者名（メーカー名）"]
[null,null,null,"型式名"]
[null,null,null,"機器の種類"]
[null,null,null,"能力・容量"]
[]
[]
[null,"（14）バイオマス原料受入・供給設備"]
[null,null,"①","製造者名（メーカー名）"]
[null,null,null,"型式名"]
[null,null,null,"機器の種類"]
[null,null,null,"能力・容量"]
[]
[null,null,"②","製造者名（メーカー名）"]
[null,null,null,"型式名"]
[null,null,null,"機器の種類"]
[null,null,null,"能力・容量"]
[]
[null,null,"③","製造者名（メーカー名）"]
[null,null,null,"型式名"]
[null,null,null,"機器の種類"]
[null,null,null,"能力・容量"]
[]
[]
[]
[]
[]
[]
[]
[]
[]
[]
[]
[]
[null,"（15）バイオマス燃料貯蔵設備"]
[null,null,"①","製造者名（メーカー名）"]
[null,null,null,"型式名"]
[null,null,null,"機器の種類"]
[null,null,null,"能力・容量"]
[]
[null,null,"②","製造者名（メーカー名）"]
[null,null,null,"型式名"]
[null,null,null,"機器の種類"]
[null,null,null,"能力・容量"]
[]
[null,null,"③","製造者名（メーカー名）"]
[null,null,null,"型式名"]
[null,null,null,"機器の種類"]
[null,null,null,"能力・容量"]
[]
[]
[null,"（16）前処理設備"]
[null,null,"①","製造者名（メーカー名）"]
[null,null,null,"型式名"]
[null,null,null,"機器の種類"]
[null,null,null,"能力・容量"]
[]
[null,null,"②","製造者名（メーカー名）"]
[null,null,null,"型式名"]
[null,null,null,"機器の種類"]
[null,null,null,"能力・容量"]
[]
[null,null,"③","製造者名（メーカー名）"]
[null,null,null,"型式名"]
[null,null,null,"機器の種類"]
[null,null,null,"能力・容量"]
[]
[]
[null,"（17）後処理設備"]
[null,null,"①","製造者名（メーカー名）"]
[null,null,null,"型式名"]
[null,null,null,"機器の種類"]
[null,null,null,"能力・容量"]
[]
[null,null,"②","製造者名（メーカー名）"]
[null,null,null,"型式名"]
[null,null,null,"機器の種類"]
[null,null,null,"能力・容量"]
[]
[null,null,"③","製造者名（メーカー名）"]
[null,null,null,"型式名"]
[null,null,null,"機器の種類"]
[null,null,null,"能力・容量"]
[]
[]
[null,"※バイオマス燃料製造を実施する場合のみ"]
[null,"・利用計画及び生産計画"]
[null,null,null,null,null,null,null,"（単位：",{"$f":"IF(G169<>\"気体\",\"kg\",\"N㎥\")","v":"kg"},"/年）"]
[null,"年次",null,"年間生産量","バイオマス燃料年間利用量"]
[null,null,null,null,null,null,null,null,null,"合計"]
[null,"1年目",null,null,null,null,null,null,null,{"$f":"SUM(E260:I260)","v":0}]
[null,"2年目",null,null,null,null,null,null,null,0]
[null,"3年目",null,null,null,null,null,null,null,0]
[null,"4年目",null,null,null,null,null,null,null,0]
[null,"5年目",null,null,null,null,null,null,null,0]
[null,"6年目",null,null,null,null,null,null,null,0]
[null,"7年目",null,null,null,null,null,null,null,0]
[null,"8年目",null,null,null,null,null,null,null,0]
[null,"9年目",null,null,null,null,null,null,null,0]
[null,"10年目",null,null,null,null,null,null,null,0]
[null,"11年目",null,null,null,null,null,null,null,0]
[null,"12年目",null,null,null,null,null,null,null,0]
[null,"13年目",null,null,null,null,null,null,null,0]
[null,"14年目",null,null,null,null,null,null,null,0]
[null,"15年目",null,null,null,null,null,null,null,0]
[]
[null,null,"年間最大生産量",null,null,{"$f":"MAX(D260:D274)","v":0}]
[]
[null,null,"年間最大利用量",null,null,{"$f":"MAX(J260:J274)","v":0}]
[]
[null,null,"設備利用率",null,null,{"$f":"IF(D260=\"\",\"\",F278/F276*100)","v":""},null,"％"]
[]
[null,"［添付資料］"]
[null,null,"・バイオマス燃料利用計画",null,null,null,null,"（添付資料17）"]
[null,null,"・バイオマス燃料製造計画",null,null,null,null,"（添付資料18）"]

{"sheet":"別紙１(1)_３枚目","index":17,"n_rows":49,"n_cols":13,"rows_kept":49,"cut":false,"hidden":false,"merged":[[46,7,46,8],[35,2,38,2],[35,7,35,9],[36,7,36,9],[37,7,37,9],[38,7,38,9],[39,2,40,2],[39,7,39,9],[40,7,40,9],[41,7,42,7],[41,8,42,9],[42,2,42,3],[45,1,45,3],[45,6,45,9],[21,1,40,1],[23,7,23,9],[26,7,26,9],[27,7,27,9],[29,7,29,9],[30,7,30,9],[31,7,31,9],[32,7,32,9],[33,2,34,2],[33,7,33,9],[34,7,34,9],[12,7,12,9],[13,7,13,9],[21,2,22,3],[21,7,21,9],[22,7,22,9],[23,2,32,2],[28,7,28,9],[16,2,18,2],[16,7,16,9],[17,7,17,9],[18,7,18,9],[19,8,19,9],[24,7,24,9],[25,7,25,9],[14,2,15,2],[14,7,14,9],[15,7,15,9],[2,1,2,9],[4,1,18,1],[4,2,5,3],[4,7,4,9],[5,7,5,9],[6,2,8,2],[6,7,6,9],[7,7,7,9],[8,7,8,9],[9,2,13,2],[9,7,9,9],[10,7,10,9],[11,7,11,9]]}
[null,"第４号様式：別紙１（１）（３枚目）"]
[]
[null,"バイオマス依存率計算書（バイオマス発電）"]
[]
[null,"バイオマス燃料","種類",null,"構成比","Ａ．バイオマス\n（燃料）利用量","Ｂ．バイオマス\n（燃料）低位発熱量","バイオマス\n（燃料）発熱量"]
[null,null,null,null,"％","kg/h",{"$f":"IF(F6=\"kg/h\",\"MJ/kg\",\"MJ/N㎥\")","v":"MJ/kg"},"MJ/h",null,null,null,null,"←利用量の単位は、プルダウンリストから選択してください"]
[null,null,"紙くず","紙類",{"$f":"IFERROR(F7/SUM($F$7:$F$19,$F$24:$F$41)*100,\"\")","v":""},null,null,{"$f":"F7*G7","v":0}]
[null,null,null,"新聞紙",{"$f":"IFERROR(F8/SUM($F$7:$F$19,$F$24:$F$41)*100,\"\")","v":""},null,null,{"$f":"F8*G8","v":0}]
[null,null,null,"紙管","",null,null,0]
[null,null,"木くず","草・木","",null,null,0]
[null,null,null,"おがくず",{"$f":"IFERROR(F11/SUM($F$7:$F$19,$F$24:$F$41)*100,\"\")","v":""},null,null,0]
[null,null,null,"木片","",null,null,0]
[null,null,null,"ベニア・合板・化粧版","",null,null,0]
[null,null,null,"集成材・ボード","",null,null,0]
[null,null,"繊維くず","木綿","",null,null,0]
[null,null,null,"羊毛","",null,null,0]
[null,null,"その他","一般雑芥","",null,null,0]
[null,null,null,"廃油(動植物系)","",null,null,0]
[null,null,null,"その他","",null,null,0]
[null,null,null,null,null,null,null,"①",{"$f":"SUM(H7:J19)","v":0}]
[]
[null,"非バイオマス燃料","種類",null,"構成比","Ｃ．非バイオマス\n（燃料）利用量","Ｄ．非バイオマス\n（燃料）低位発熱量","非バイオマス\n（燃料）発熱量"]
[null,null,null,null,"％",{"$f":"F6","v":"kg/h"},{"$f":"G6","v":"MJ/kg"},"MJ/h"]
[null,null,"廃プラスチック類","ポリエチレン（ＰＥ）",{"$f":"IFERROR(F24/SUM($F$7:$F$19,$F$24:$F$41)*100,\"\")","v":""},null,null,{"$f":"F24*G24","v":0}]
[null,null,null,"ポリプロピレン（ＰＰ）",{"$f":"IFERROR(F25/SUM($F$7:$F$19,$F$24:$F$41)*100,\"\")","v":""},null,null,0]
[null,null,null,"ポリスチレン（ＰＳ）",{"$f":"IFERROR(F26/SUM($F$7:$F$19,$F$24:$F$41)*100,\"\")","v":""},null,null,{"$f":"F26*G26","v":0}]
[null,null,null,"発泡スチロール","",null,null,0]
[null,null,null,"ＦＲＰ樹脂","",null,null,0]
[null,null,null,"フェノール樹脂","",null,null,0]
[null,null,null,"熱可塑性樹脂","",null,null,0]
[null,null,null,"混合樹脂製品","",null,null,0]
[null,null,null,"ＰＥＴボトル","",null,null,0]
[null,null,null,"皮製品","",null,null,0]
[null,null,"ゴムくず","タイヤ","",null,null,0]
[null,null,null,"合成ゴム","",null,null,0]
[null,null,"繊維くず","ナイロン布","",null,null,0]
[null,null,null,"アクリル布","",null,null,0]
[null,null,null,"ビニロン布","",null,null,0]
[null,null,null,"ポリエステル布","",null,null,0]
[null,null,"その他","廃油（石油系）","",null,null,0]
[null,null,null,"その他","",null,null,0]
[null,null,null,null,null,null,null,"②",{"$f":"SUM(H24:J41)","v":0}]
[null,null,"構成比の合計",null,{"$f":"SUM(E7:E19,E24:E41)","v":0}]
[]
[]
[null,"バイオマス依存率＝",null,null,null,null,"×100＝ ①/（①+②）×100"]
[null,null,null,null,null,null,"＝",{"$f":"IF(I20=0,0,I20/(I20+I42)*100)","v":0},null,"％",null,null,"※バイオマス依存率60％以上"]
[]
[null,null,"・バイオマス排水、家畜糞尿、食品残渣等を原料にする場合は、バイオマス依存率を１００％とする。"]

{"sheet":"別紙１(2)_３枚目","index":18,"n_rows":50,"n_cols":13,"rows_kept":50,"cut":false,"hidden":false,"merged":[[46,7,46,8],[35,2,38,2],[35,7,35,9],[36,7,36,9],[37,7,37,9],[38,7,38,9],[39,2,40,2],[39,7,39,9],[40,7,40,9],[41,7,42,7],[41,8,42,9],[42,2,42,3],[45,1,45,3],[45,6,45,9],[21,1,40,1],[23,7,23,9],[26,7,26,9],[27,7,27,9],[29,7,29,9],[30,7,30,9],[31,7,31,9],[32,7,32,9],[33,2,34,2],[33,7,33,9],[34,7,34,9],[12,7,12,9],[13,7,13,9],[21,2,22,3],[21,7,21,9],[22,7,22,9],[23,2,32,2],[28,7,28,9],[16,2,18,2],[16,7,16,9],[17,7,17,9],[18,7,18,9],[19,8,19,9],[24,7,24,9],[25,7,25,9],[14,2,15,2],[14,7,14,9],[15,7,15,9],[2,1,2,9],[4,1,18,1],[4,2,5,3],[4,7,4,9],[5,7,5,9],[6,2,8,2],[6,7,6,9],[7,7,7,9],[8,7,8,9],[9,2,13,2],[9,7,9,9],[10,7,10,9],[11,7,11,9]]}
[null,"第４号様式：別紙１（２）（３枚目）"]
[]
[null,"バイオマス依存率計算書（バイオマス燃料製造）"]
[]
[null,"バイオマス燃料","種類",null,"構成比","Ａ．バイオマス\n（原料）利用量","Ｂ．バイオマス\n（原料）低位発熱量","バイオマス\n（原料）発熱量"]
[null,null,null,null,"％","kg/h",{"$f":"IF(F6=\"kg/h\",\"MJ/kg\",\"MJ/N㎥\")","v":"MJ/kg"},"MJ/h",null,null,null,null,"←利用量の単位は、プルダウンリストから選択してください"]
[null,null,"紙くず","紙類",{"$f":"IFERROR(F7/SUM($F$7:$F$19,$F$24:$F$41)*100,\"\")","v":""},null,null,{"$f":"F7*G7","v":0}]
[null,null,null,"新聞紙",{"$f":"IFERROR(F8/SUM($F$7:$F$19,$F$24:$F$41)*100,\"\")","v":""},null,null,{"$f":"F8*G8","v":0}]
[null,null,null,"紙管","",null,null,0]
[null,null,"木くず","草・木","",null,null,0]
[null,null,null,"おがくず","",null,null,0]
[null,null,null,"木片","",null,null,0]
[null,null,null,"ベニア・合板・化粧版","",null,null,0]
[null,null,null,"集成材・ボード","",null,null,0]
[null,null,"繊維くず","木綿","",null,null,0]
[null,null,null,"羊毛","",null,null,0]
[null,null,"その他","一般雑芥","",null,null,0]
[null,null,null,"廃油(動植物系)","",null,null,0]
[null,null,null,"その他","",null,null,0]
[null,null,null,null,null,null,null,"①",{"$f":"SUM(H7:J19)","v":0}]
[]
[null,"非バイオマス燃料","種類",null,"構成比","Ｃ．非バイオマス\n（原料）利用量","Ｄ．非バイオマス\n（原料）低位発熱量","非バイオマス\n（原料）発熱量"]
[null,null,null,null,"％",{"$f":"F6","v":"kg/h"},{"$f":"G6","v":"MJ/kg"},"MJ/h"]
[null,null,"廃プラスチック類","ポリエチレン（ＰＥ）",{"$f":"IFERROR(F24/SUM($F$7:$F$19,$F$24:$F$41)*100,\"\")","v":""},null,null,{"$f":"F24*G24","v":0}]
[null,null,null,"ポリプロピレン（ＰＰ）","",null,null,0]
[null,null,null,"ポリスチレン（ＰＳ）","",null,null,0]
[null,null,null,"発泡スチロール","",null,null,0]
[null,null,null,"ＦＲＰ樹脂","",null,null,0]
[null,null,null,"フェノール樹脂","",null,null,0]
[null,null,null,"熱可塑性樹脂","",null,null,0]
[null,null,null,"混合樹脂製品","",null,null,0]
[null,null,null,"ＰＥＴボトル","",null,null,0]
[null,null,null,"皮製品","",null,null,0]
[null,null,"ゴムくず","タイヤ","",null,null,0]
[null,null,null,"合成ゴム","",null,null,0]
[null,null,"繊維くず","ナイロン布","",null,null,0]
[null,null,null,"アクリル布","",null,null,0]
[null,null,null,"ビニロン布","",null,null,0]
[null,null,null,"ポリエステル布","",null,null,0]
[null,null,"その他","廃油（石油系）","",null,null,0]
[null,null,null,"その他","",null,null,0]
[null,null,null,null,null,null,null,"②",{"$f":"SUM(H24:J41)","v":0}]
[null,null,"構成比の合計",null,{"$f":"SUM(E7:E19,E24:E41)","v":0}]
[]
[]
[null,"バイオマス依存率＝",null,null,null,null,"×100＝ ①/（①+②）×100"]
[null,null,null,null,null,null,"＝",{"$f":"IF(I20=0,0,I20/(I20+I42)*100)","v":0},null,"％",null,null,"※バイオマス依存率60％以上"]
[]
[null,null,"・バイオマス排水、家畜糞尿、食品残渣等を原料にする場合は、バイオマス依存率を１００％とする。"]
[null,null,"・メタン発酵方式の場合は、発酵槽へ投じられるものをバイオマス原料とする。"]

{"sheet":"第4号.バイオマス発電設備の概要_４枚目","index":19,"n_rows":284,"n_cols":14,"rows_kept":284,"cut":false,"hidden":false,"merged":[[275,5,275,6],[277,5,277,6],[279,5,279,6],[268,1,268,2],[269,1,269,2],[270,1,270,2],[271,1,271,2],[272,1,272,2],[273,1,273,2],[262,1,262,2],[263,1,263,2],[264,1,264,2],[265,1,265,2],[266,1,266,2],[267,1,267,2],[257,1,258,2],[257,3,258,3],[257,4,257,9],[259,1,259,2],[260,1,260,2],[261,1,261,2],[249,3,249,5],[249,6,249,9],[250,3,250,5],[250,6,250,9],[251,3,251,5],[251,6,251,9],[245,3,245,5],[245,6,245,9],[246,3,246,5],[246,6,246,9],[248,3,248,5],[248,6,248,9],[241,3,241,5],[241,6,241,9],[243,3,243,5],[243,6,243,9],[244,3,244,5],[244,6,244,9],[238,3,238,5],[238,6,238,9],[239,3,239,5],[239,6,239,9],[240,3,240,5],[240,6,240,9],[232,3,232,5],[232,6,232,9],[233,3,233,5],[233,6,233,9],[234,3,234,5],[234,6,234,9],[228,3,228,5],[228,6,228,9],[229,3,229,5],[229,6,229,9],[231,3,231,5],[231,6,231,9],[224,3,224,5],[224,6,224,9],[226,3,226,5],[226,6,226,9],[227,3,227,5],[227,6,227,9],[221,3,221,5],[221,6,221,9],[222,3,222,5],[222,6,222,9],[223,3,223,5],[223,6,223,9],[215,3,215,5],[215,6,215,9],[216,3,216,5],[216,6,216,9],[217,3,217,5],[217,6,217,9],[211,3,211,5],[211,6,211,9],[212,3,212,5],[212,6,212,9],[214,3,214,5],[214,6,214,9],[207,3,207,5],[207,6,207,9],[209,3,209,5],[209,6,209,9],[210,3,210,5],[210,6,210,9],[204,3,204,5],[204,6,204,9],[205,3,205,5],[205,6,205,9],[206,3,206,5],[206,6,206,9],[188,3,188,5],[188,6,188,9],[189,3,189,5],[189,6,189,9],[190,3,190,5],[190,6,190,9],[184,3,184,5],[184,6,184,9],[185,3,185,5],[185,6,185,9],[187,3,187,5],[187,6,187,9],[180,3,180,5],[180,6,180,9],[182,3,182,5],[182,6,182,9],[183,3,183,5],[183,6,183,9],[177,3,177,5],[177,6,177,9],[178,3,178,5],[178,6,178,9],[179,3,179,5],[179,6,179,9],[171,3,171,5],[171,6,171,9],[172,3,172,5],[172,6,172,9],[173,3,173,5],[173,6,173,9],[167,3,167,5],[167,6,167,9],[168,3,168,5],[168,6,168,9],[170,3,170,5],[170,6,170,9],[163,3,163,5],[163,6,163,9],[165,3,165,5],[165,6,165,9],[166,3,166,5],[166,6,166,9],[160,3,160,5],[160,6,160,9],[161,3,161,5],[161,6,161,9],[162,3,162,5],[162,6,162,9],[154,3,154,5],[154,6,154,8],[155,3,155,5],[155,6,155,8],[156,3,156,5],[156,6,156,8],[146,13,147,15],[149,3,149,5],[149,6,149,8],[150,12,151,12],[153,3,153,5],[153,6,153,8],[120,3,120,5],[120,6,120,8],[121,3,121,5],[121,6,121,8],[145,3,145,4],[145,6,145,8],[117,3,117,5],[117,6,117,8],[118,3,118,5],[118,6,118,8],[119,3,119,5],[119,6,119,8],[113,3,113,5],[113,6,113,8],[114,3,114,5],[114,6,114,8],[116,3,116,5],[116,6,116,8],[110,3,110,5],[110,6,110,8],[111,3,111,5],[111,6,111,8],[112,3,112,5],[112,6,112,8],[106,3,106,5],[106,6,106,8],[107,3,107,5],[107,6,107,8],[109,3,109,5],[109,6,109,8],[103,3,103,5],[103,6,103,8],[104,3,104,5],[104,6,104,8],[105,3,105,5],[105,6,105,8],[97,3,97,5],[97,6,97,8],[98,3,98,5],[98,6,98,8],[102,3,102,5],[102,6,102,8],[94,3,94,5],[94,6,94,8],[95,3,95,5],[95,6,95,8],[96,3,96,5],[96,6,96,8],[90,3,90,5],[90,6,90,8],[91,3,91,5],[91,6,91,8],[93,3,93,5],[93,6,93,8],[87,3,87,5],[87,6,87,8],[88,3,88,5],[88,6,88,8],[89,3,89,5],[89,6,89,8],[83,3,83,5],[83,6,83,8],[84,3,84,5],[84,6,84,8],[86,3,86,5],[86,6,86,8],[80,3,80,5],[80,6,80,8],[81,3,81,5],[81,6,81,8],[82,3,82,5],[82,6,82,8],[74,3,74,5],[74,6,74,8],[75,3,75,5],[75,6,75,8],[79,3,79,5],[79,6,79,8],[71,3,71,5],[71,6,71,8],[72,3,72,5],[72,6,72,8],[73,3,73,5],[73,6,73,8],[67,3,67,5],[67,6,67,8],[68,3,68,5],[68,6,68,8],[70,3,70,5],[70,6,70,8],[64,3,64,5],[64,6,64,8],[65,3,65,5],[65,6,65,8],[66,3,66,5],[66,6,66,8],[60,3,60,5],[60,6,60,8],[61,3,61,5],[61,6,61,8],[63,3,63,5],[63,6,63,8],[57,3,57,5],[57,6,57,8],[58,3,58,5],[58,6,58,8],[59,3,59,5],[59,6,59,8],[51,3,51,5],[51,6,51,8],[52,3,52,5],[52,6,52,8],[56,3,56,5],[56,6,56,8],[48,3,48,5],[48,6,48,8],[49,3,49,5],[49,6,49,8],[50,3,50,5],[50,6,50,8],[44,3,44,5],[44,6,44,8],[45,3,45,5],[45,6,45,8],[47,3,47,5],[47,6,47,8],[41,3,41,5],[41,6,41,8],[42,3,42,5],[42,6,42,8],[43,3,43,5],[43,6,43,8],[37,3,37,5],[37,6,37,8],[38,3,38,5],[38,6,38,8],[40,3,40,5],[40,6,40,8],[34,3,34,5],[34,6,34,8],[35,3,35,5],[35,6,35,8],[36,3,36,5],[36,6,36,8],[28,3,28,5],[28,6,28,8],[29,3,29,5],[29,6,29,8],[33,3,33,5],[33,6,33,8],[19,3,19,5],[19,6,19,8],[25,3,25,5],[25,6,25,8],[26,3,26,5],[26,6,26,8],[13,3,13,5],[13,6,13,8],[14,3,14,5],[14,6,14,8],[18,3,18,5],[18,6,18,8],[5,2,5,4],[5,5,5,9],[7,3,7,4],[11,3,11,5],[11,6,11,8],[12,3,12,5],[12,6,12,8]]}
[null,"２．設備の概要（４枚目）"]
[null,"　※複数の型式を導入する場合は、それぞれの型式ごとにまとめること。"]
[]
[null,"（１）設備導入場所ごとの設備概要"]
[]
[null,null,"導入場所名称",null,null,{"$f":"'第4号.バイオマス発電'!E33","v":0}]
[]
[null,null,null,"発電総出力",null,null,{"$f":"IF(G37=\"\",0,ROUNDDOWN(SUM(G39,G46,G53),0))","v":0},"kW",null,null,null,null,"※発電出力10kW以上"]
[]
[]
[null,"（２）バイオマス発電設備"]
[null,null,null,"形態",null,null,null,null,null,null,null,null,"←プルダウンリストから選択してください"]
[null,null,null,"１日あたりの設備稼働時間",null,null,null,null,null,"ｈ/日"]
[null,null,null,"年間稼働日数",null,null,null,null,null,"日"]
[null,null,null,"年間稼働時間",null,null,{"$f":"IF(G13=\"\",\"\",ROUNDDOWN((G13*G14),2))","v":""},null,null,"ｈ/年"]
[]
[]
[null,"（３）バイオマス燃料"]
[null,null,null,"種類"]
[null,null,null,"バイオマス依存率（※）",null,null,{"$f":"'別紙１(1)_４枚目'!$H$47","v":0},null,null,"％",null,null,"←別紙４を作成すると自動計算されます"]
[null,null,null,"※算定方法は、別紙3のとおり。",null,null,null,null,null,null,null,null,"※バイオマス依存率60％以上"]
[]
[]
[null,"（４）助成燃料等　（※使用する場合のみ記入）"]
[null,null,null,"スタートアップの場合"]
[null,null,null,"使用量",null,null,null,null,null,"ｔ/回"]
[null,null,null,"使用頻度",null,null,null,null,null,"回/年"]
[null,null,null,"その他"]
[null,null,null,"使用量",null,null,null,null,null,"ｔ/回"]
[null,null,null,"使用頻度",null,null,null,null,null,"回/年"]
[]
[]
[null,"（５）発電機"]
[null,null,"①","製造者名（メーカー名）"]
[null,null,null,"型式名"]
[null,null,null,"発電方式",null,null,null,null,null,null,null,null,"←プルダウンリストから選択してください"]
[null,null,null,"１台あたりの定格出力",null,null,null,null,null,"kW"]
[null,null,null,"台数",null,null,null,null,null,"台"]
[null,null,null,"定格出力合計",null,null,{"$f":"IF(G37=\"\",\"\",ROUNDDOWN(G37*G38,1))","v":""},null,null,"kW"]
[]
[null,null,"②","製造者名（メーカー名）"]
[null,null,null,"型式名"]
[null,null,null,"発電方式",null,null,null,null,null,null,null,null,"←プルダウンリストから選択してください"]
[null,null,null,"１台あたりの定格出力",null,null,null,null,null,"kW"]
[null,null,null,"台数",null,null,null,null,null,"台"]
[null,null,null,"定格出力合計",null,null,{"$f":"IF(G44=\"\",\"\",ROUNDDOWN(G44*G45,1))","v":""},null,null,"kW"]
[]
[null,null,"③","製造者名（メーカー名）"]
[null,null,null,"型式名"]
[null,null,null,"発電方式",null,null,null,null,null,null,null,null,"←プルダウンリストから選択してください"]
[null,null,null,"１台あたりの定格出力",null,null,null,null,null,"kW"]
[null,null,null,"台数",null,null,null,null,null,"台"]
[null,null,null,"定格出力合計",null,null,{"$f":"IF(G51=\"\",\"\",ROUNDDOWN(G51*G52,1))","v":""},null,null,"kW"]
[]
[]
[null,"（６）バイオマスボイラ-"]
[null,null,"①","製造者名（メーカー名）"]
[null,null,null,"型式名"]
[null,null,null,"機器の種類"]
[null,null,null,"１台あたりの能力",null,null,null,null,null,"kW"]
[null,null,null,"台数",null,null,null,null,null,"台"]
[null,null,null,"能力合計",null,null,{"$f":"IF(G60=\"\",\"\",ROUNDDOWN(G60*G61,2))","v":""},null,null,"kW"]
[]
[null,null,"②","製造者名（メーカー名）"]
[null,null,null,"型式名"]
[null,null,null,"機器の種類"]
[null,null,null,"１台あたりの能力",null,null,null,null,null,"kW"]
[null,null,null,"台数",null,null,null,null,null,"台"]
[null,null,null,"能力合計",null,null,{"$f":"IF(G67=\"\",\"\",ROUNDDOWN(G67*G68,2))","v":""},null,null,"kW"]
[]
[null,null,"③","製造者名（メーカー名）"]
[null,null,null,"型式名"]
[null,null,null,"機器の種類"]
[null,null,null,"１台あたりの能力",null,null,null,null,null,"kW"]
[null,null,null,"台数",null,null,null,null,null,"台"]
[null,null,null,"能力合計",null,null,{"$f":"IF(G74=\"\",\"\",ROUNDDOWN(G74*G75,2))","v":""},null,null,"kW"]
[]
[]
[null,"（７）バイオマス受入・供給設備　（※設置する場合のみ記入）"]
[null,null,"①","製造者名（メーカー名）"]
[null,null,null,"型式名"]
[null,null,null,"機器の種類"]
[null,null,null,"１基あたりの容量",null,null,null,null,null,"ｍ3"]
[null,null,null,"台数",null,null,null,null,null,"基"]
[null,null,null,"容量合計",null,null,{"$f":"IF(G83=\"\",\"\",ROUNDDOWN(G83*G84,2))","v":""},null,null,"ｍ3"]
[]
[null,null,"②","製造者名（メーカー名）"]
[null,null,null,"型式名"]
[null,null,null,"機器の種類"]
[null,null,null,"１基あたりの容量",null,null,null,null,null,"ｍ3"]
[null,null,null,"台数",null,null,null,null,null,"基"]
[null,null,null,"容量合計",null,null,{"$f":"IF(G90=\"\",\"\",ROUNDDOWN(G90*G91,2))","v":""},null,null,"ｍ3"]
[]
[null,null,"③","製造者名（メーカー名）"]
[null,null,null,"型式名"]
[null,null,null,"機器の種類"]
[null,null,null,"１基あたりの容量",null,null,null,null,null,"ｍ3"]
[null,null,null,"台数",null,null,null,null,null,"基"]
[null,null,null,"容量合計",null,null,{"$f":"IF(G97=\"\",\"\",ROUNDDOWN(G97*G98,2))","v":""},null,null,"ｍ3"]
[]
[]
[null,"（８）冷却塔　（※設置する場合のみ記入）"]
[null,null,"①","製造者名（メーカー名）"]
[null,null,null,"型式名"]
[null,null,null,"機器の種類"]
[null,null,null,"１台あたりの能力",null,null,null,null,null,"kW"]
[null,null,null,"台数",null,null,null,null,null,"台"]
[null,null,null,"能力合計",null,null,{"$f":"IF(G106=\"\",\"\",ROUNDDOWN(G106*G107,2))","v":""},null,null,"kW"]
[]
[null,null,"②","製造者名（メーカー名）"]
[null,null,null,"型式名"]
[null,null,null,"機器の種類"]
[null,null,null,"１台あたりの能力",null,null,null,null,null,"kW"]
[null,null,null,"台数",null,null,null,null,null,"台"]
[null,null,null,"能力合計",null,null,{"$f":"IF(G113=\"\",\"\",ROUNDDOWN(G113*G114,2))","v":""},null,null,"kW"]
[]
[null,null,"③","製造者名（メーカー名）"]
[null,null,null,"型式名"]
[null,null,null,"機器の種類"]
[null,null,null,"１台あたりの能力",null,null,null,null,null,"kW"]
[null,null,null,"台数",null,null,null,null,null,"台"]
[null,null,null,"能力合計",null,null,{"$f":"IF(G120=\"\",\"\",ROUNDDOWN(G120*G121,2))","v":""},null,null,"kW"]
[]
[]
[null,null,"［添付資料］"]
[null,null,"・","主要設備のカタログ、パンフレット等",null,null,"（添付資料７）"]
[null,null,"・","システム系統図",null,null,"（添付資料８）"]
[null,null,"・","単線結線図",null,null,"（添付資料９）"]
[null,null,"・","機器配置図",null,null,"（添付資料10）"]
[null,null,"・","バイオマスの調達に係る資料",null,null,"（添付資料14）"]
[null,null,"・","灰の処分に係る資料",null,null,"（添付資料15）"]
[null,null,"・","低位発熱量を証明する資料",null,null,"（添付資料16）"]
[]
[]
[]
[]
[]
[]
[]
[]
[]
[]
[]
[null,"※バイオマス燃料製造を実施する場合のみ"]
[null,"（10）バイオマス燃料製造方式"]
[null,null,null,"形態　　：",null,null,null,null,null,null,null,null,"←プルダウンリストから選択してください"]
[null,null,null,null,null,null,null,null,null,null,null,null,null,"１．メタン発酵方式"]
[]
[null,"（11）製造時のバイオマス依存率",null,null,null,null,null,null,null,null,null,null,null,"　・ガス製造量：100 N㎥／日 以上"]
[null,null,null,"バイオマス依存率",null,null,{"$f":"'別紙１(2)_４枚目'!$H$47","v":0},null,null,"％",null,null,"←別紙４を作成すると自動計算される","　・低位発熱量：18.84 MJ／N㎥（4,500kcal／N ㎥）以上"]
[null,null,null,null,null,null,null,null,null,null,null,null,"※バイオマス依存率60％以上"]
[]
[null,"（12）製造するバイオマス燃料",null,null,null,null,null,null,null,null,null,null,null,"２．メタン発酵方式以外"]
[null,null,null,"名称",null,null,null,null,null,null,null,null,null,"　・製造量：固形化 150kg／日 以上"]
[null,null,null,"形態",null,null,null,null,null,null,null,null,"←プルダウンリストから選択してください","　　　　　　　液 化 100kg／日 以上"]
[null,null,null,"製造量",null,null,null,null,null,{"$f":"IF(G155<>\"気体\",\"kg/日\",\"N㎥/日\")","v":"kg/日"},null,null,null,"　　　　　　　ガス化 450N㎥／日 以上"]
[null,null,null,"低位発熱量",null,null,null,null,null,{"$f":"IF(G155<>\"気体\",\"MJ/kg\",\"MJ/N㎥\")","v":"MJ/kg"},null,null,null,"（ただし、離島及びへき地は、上記要件を除く。）"]
[]
[]
[null,"（13）バイオマス燃料製造設備"]
[null,null,"①","製造者名（メーカー名）"]
[null,null,null,"型式名"]
[null,null,null,"機器の種類"]
[null,null,null,"能力・容量"]
[]
[null,null,"②","製造者名（メーカー名）"]
[null,null,null,"型式名"]
[null,null,null,"機器の種類"]
[null,null,null,"能力・容量"]
[]
[null,null,"③","製造者名（メーカー名）"]
[null,null,null,"型式名"]
[null,null,null,"機器の種類"]
[null,null,null,"能力・容量"]
[]
[]
[null,"（14）バイオマス原料受入・供給設備"]
[null,null,"①","製造者名（メーカー名）"]
[null,null,null,"型式名"]
[null,null,null,"機器の種類"]
[null,null,null,"能力・容量"]
[]
[null,null,"②","製造者名（メーカー名）"]
[null,null,null,"型式名"]
[null,null,null,"機器の種類"]
[null,null,null,"能力・容量"]
[]
[null,null,"③","製造者名（メーカー名）"]
[null,null,null,"型式名"]
[null,null,null,"機器の種類"]
[null,null,null,"能力・容量"]
[]
[]
[]
[]
[]
[]
[]
[]
[]
[]
[]
[]
[null,"（15）バイオマス燃料貯蔵設備"]
[null,null,"①","製造者名（メーカー名）"]
[null,null,null,"型式名"]
[null,null,null,"機器の種類"]
[null,null,null,"能力・容量"]
[]
[null,null,"②","製造者名（メーカー名）"]
[null,null,null,"型式名"]
[null,null,null,"機器の種類"]
[null,null,null,"能力・容量"]
[]
[null,null,"③","製造者名（メーカー名）"]
[null,null,null,"型式名"]
[null,null,null,"機器の種類"]
[null,null,null,"能力・容量"]
[]
[]
[null,"（16）前処理設備"]
[null,null,"①","製造者名（メーカー名）"]
[null,null,null,"型式名"]
[null,null,null,"機器の種類"]
[null,null,null,"能力・容量"]
[]
[null,null,"②","製造者名（メーカー名）"]
[null,null,null,"型式名"]
[null,null,null,"機器の種類"]
[null,null,null,"能力・容量"]
[]
[null,null,"③","製造者名（メーカー名）"]
[null,null,null,"型式名"]
[null,null,null,"機器の種類"]
[null,null,null,"能力・容量"]
[]
[]
[null,"（17）後処理設備"]
[null,null,"①","製造者名（メーカー名）"]
[null,null,null,"型式名"]
[null,null,null,"機器の種類"]
[null,null,null,"能力・容量"]
[]
[null,null,"②","製造者名（メーカー名）"]
[null,null,null,"型式名"]
[null,null,null,"機器の種類"]
[null,null,null,"能力・容量"]
[]
[null,null,"③","製造者名（メーカー名）"]
[null,null,null,"型式名"]
[null,null,null,"機器の種類"]
[null,null,null,"能力・容量"]
[]
[]
[null,"※バイオマス燃料製造を実施する場合のみ"]
[null,"・利用計画及び生産計画"]
[null,null,null,null,null,null,null,"（単位：",{"$f":"IF(G169<>\"気体\",\"kg\",\"N㎥\")","v":"kg"},"/年）"]
[null,"年次",null,"年間生産量","バイオマス燃料年間利用量"]
[null,null,null,null,null,null,null,null,null,"合計"]
[null,"1年目",null,null,null,null,null,null,null,{"$f":"SUM(E260:I260)","v":0}]
[null,"2年目",null,null,null,null,null,null,null,0]
[null,"3年目",null,null,null,null,null,null,null,0]
[null,"4年目",null,null,null,null,null,null,null,0]
[null,"5年目",null,null,null,null,null,null,null,0]
[null,"6年目",null,null,null,null,null,null,null,0]
[null,"7年目",null,null,null,null,null,null,null,0]
[null,"8年目",null,null,null,null,null,null,null,0]
[null,"9年目",null,null,null,null,null,null,null,0]
[null,"10年目",null,null,null,null,null,null,null,0]
[null,"11年目",null,null,null,null,null,null,null,0]
[null,"12年目",null,null,null,null,null,null,null,0]
[null,"13年目",null,null,null,null,null,null,null,0]
[null,"14年目",null,null,null,null,null,null,null,0]
[null,"15年目",null,null,null,null,null,null,null,0]
[]
[null,null,"年間最大生産量",null,null,{"$f":"MAX(D260:D274)","v":0}]
[]
[null,null,"年間最大利用量",null,null,{"$f":"MAX(J260:J274)","v":0}]
[]
[null,null,"設備利用率",null,null,{"$f":"IF(D260=\"\",\"\",F278/F276*100)","v":""},null,"％"]
[]
[null,"［添付資料］"]
[null,null,"・バイオマス燃料利用計画",null,null,null,null,"（添付資料17）"]
[null,null,"・バイオマス燃料製造計画",null,null,null,null,"（添付資料18）"]

{"sheet":"別紙１(1)_４枚目","index":20,"n_rows":49,"n_cols":13,"rows_kept":49,"cut":false,"hidden":false,"merged":[[46,7,46,8],[35,2,38,2],[35,7,35,9],[36,7,36,9],[37,7,37,9],[38,7,38,9],[39,2,40,2],[39,7,39,9],[40,7,40,9],[41,7,42,7],[41,8,42,9],[42,2,42,3],[45,1,45,3],[45,6,45,9],[21,1,40,1],[23,7,23,9],[26,7,26,9],[27,7,27,9],[29,7,29,9],[30,7,30,9],[31,7,31,9],[32,7,32,9],[33,2,34,2],[33,7,33,9],[34,7,34,9],[12,7,12,9],[13,7,13,9],[21,2,22,3],[21,7,21,9],[22,7,22,9],[23,2,32,2],[28,7,28,9],[16,2,18,2],[16,7,16,9],[17,7,17,9],[18,7,18,9],[19,8,19,9],[24,7,24,9],[25,7,25,9],[14,2,15,2],[14,7,14,9],[15,7,15,9],[2,1,2,9],[4,1,18,1],[4,2,5,3],[4,7,4,9],[5,7,5,9],[6,2,8,2],[6,7,6,9],[7,7,7,9],[8,7,8,9],[9,2,13,2],[9,7,9,9],[10,7,10,9],[11,7,11,9]]}
[null,"第４号様式：別紙１（１）（４枚目）"]
[]
[null,"バイオマス依存率計算書（バイオマス発電）"]
[]
[null,"バイオマス燃料","種類",null,"構成比","Ａ．バイオマス\n（燃料）利用量","Ｂ．バイオマス\n（燃料）低位発熱量","バイオマス\n（燃料）発熱量"]
[null,null,null,null,"％","kg/h",{"$f":"IF(F6=\"kg/h\",\"MJ/kg\",\"MJ/N㎥\")","v":"MJ/kg"},"MJ/h",null,null,null,null,"←利用量の単位は、プルダウンリストから選択してください"]
[null,null,"紙くず","紙類",{"$f":"IFERROR(F7/SUM($F$7:$F$19,$F$24:$F$41)*100,\"\")","v":""},null,null,{"$f":"F7*G7","v":0}]
[null,null,null,"新聞紙",{"$f":"IFERROR(F8/SUM($F$7:$F$19,$F$24:$F$41)*100,\"\")","v":""},null,null,{"$f":"F8*G8","v":0}]
[null,null,null,"紙管","",null,null,0]
[null,null,"木くず","草・木","",null,null,0]
[null,null,null,"おがくず",{"$f":"IFERROR(F11/SUM($F$7:$F$19,$F$24:$F$41)*100,\"\")","v":""},null,null,0]
[null,null,null,"木片","",null,null,0]
[null,null,null,"ベニア・合板・化粧版","",null,null,0]
[null,null,null,"集成材・ボード","",null,null,0]
[null,null,"繊維くず","木綿","",null,null,0]
[null,null,null,"羊毛","",null,null,0]
[null,null,"その他","一般雑芥","",null,null,0]
[null,null,null,"廃油(動植物系)","",null,null,0]
[null,null,null,"その他","",null,null,0]
[null,null,null,null,null,null,null,"①",{"$f":"SUM(H7:J19)","v":0}]
[]
[null,"非バイオマス燃料","種類",null,"構成比","Ｃ．非バイオマス\n（燃料）利用量","Ｄ．非バイオマス\n（燃料）低位発熱量","非バイオマス\n（燃料）発熱量"]
[null,null,null,null,"％",{"$f":"F6","v":"kg/h"},{"$f":"G6","v":"MJ/kg"},"MJ/h"]
[null,null,"廃プラスチック類","ポリエチレン（ＰＥ）",{"$f":"IFERROR(F24/SUM($F$7:$F$19,$F$24:$F$41)*100,\"\")","v":""},null,null,{"$f":"F24*G24","v":0}]
[null,null,null,"ポリプロピレン（ＰＰ）",{"$f":"IFERROR(F25/SUM($F$7:$F$19,$F$24:$F$41)*100,\"\")","v":""},null,null,0]
[null,null,null,"ポリスチレン（ＰＳ）",{"$f":"IFERROR(F26/SUM($F$7:$F$19,$F$24:$F$41)*100,\"\")","v":""},null,null,{"$f":"F26*G26","v":0}]
[null,null,null,"発泡スチロール","",null,null,0]
[null,null,null,"ＦＲＰ樹脂","",null,null,0]
[null,null,null,"フェノール樹脂","",null,null,0]
[null,null,null,"熱可塑性樹脂","",null,null,0]
[null,null,null,"混合樹脂製品","",null,null,0]
[null,null,null,"ＰＥＴボトル","",null,null,0]
[null,null,null,"皮製品","",null,null,0]
[null,null,"ゴムくず","タイヤ","",null,null,0]
[null,null,null,"合成ゴム","",null,null,0]
[null,null,"繊維くず","ナイロン布","",null,null,0]
[null,null,null,"アクリル布","",null,null,0]
[null,null,null,"ビニロン布","",null,null,0]
[null,null,null,"ポリエステル布","",null,null,0]
[null,null,"その他","廃油（石油系）","",null,null,0]
[null,null,null,"その他","",null,null,0]
[null,null,null,null,null,null,null,"②",{"$f":"SUM(H24:J41)","v":0}]
[null,null,"構成比の合計",null,{"$f":"SUM(E7:E19,E24:E41)","v":0}]
[]
[]
[null,"バイオマス依存率＝",null,null,null,null,"×100＝ ①/（①+②）×100"]
[null,null,null,null,null,null,"＝",{"$f":"IF(I20=0,0,I20/(I20+I42)*100)","v":0},null,"％",null,null,"※バイオマス依存率60％以上"]
[]
[null,null,"・バイオマス排水、家畜糞尿、食品残渣等を原料にする場合は、バイオマス依存率を１００％とする。"]

{"sheet":"別紙１(2)_４枚目","index":21,"n_rows":50,"n_cols":13,"rows_kept":50,"cut":false,"hidden":false,"merged":[[46,7,46,8],[35,2,38,2],[35,7,35,9],[36,7,36,9],[37,7,37,9],[38,7,38,9],[39,2,40,2],[39,7,39,9],[40,7,40,9],[41,7,42,7],[41,8,42,9],[42,2,42,3],[45,1,45,3],[45,6,45,9],[21,1,40,1],[23,7,23,9],[26,7,26,9],[27,7,27,9],[29,7,29,9],[30,7,30,9],[31,7,31,9],[32,7,32,9],[33,2,34,2],[33,7,33,9],[34,7,34,9],[12,7,12,9],[13,7,13,9],[21,2,22,3],[21,7,21,9],[22,7,22,9],[23,2,32,2],[28,7,28,9],[16,2,18,2],[16,7,16,9],[17,7,17,9],[18,7,18,9],[19,8,19,9],[24,7,24,9],[25,7,25,9],[14,2,15,2],[14,7,14,9],[15,7,15,9],[2,1,2,9],[4,1,18,1],[4,2,5,3],[4,7,4,9],[5,7,5,9],[6,2,8,2],[6,7,6,9],[7,7,7,9],[8,7,8,9],[9,2,13,2],[9,7,9,9],[10,7,10,9],[11,7,11,9]]}
[null,"第４号様式：別紙１（２）（４枚目）"]
[]
[null,"バイオマス依存率計算書（バイオマス燃料製造）"]
[]
[null,"バイオマス燃料","種類",null,"構成比","Ａ．バイオマス\n（原料）利用量","Ｂ．バイオマス\n（原料）低位発熱量","バイオマス\n（原料）発熱量"]
[null,null,null,null,"％","kg/h",{"$f":"IF(F6=\"kg/h\",\"MJ/kg\",\"MJ/N㎥\")","v":"MJ/kg"},"MJ/h",null,null,null,null,"←利用量の単位は、プルダウンリストから選択してください"]
[null,null,"紙くず","紙類",{"$f":"IFERROR(F7/SUM($F$7:$F$19,$F$24:$F$41)*100,\"\")","v":""},null,null,{"$f":"F7*G7","v":0}]
[null,null,null,"新聞紙",{"$f":"IFERROR(F8/SUM($F$7:$F$19,$F$24:$F$41)*100,\"\")","v":""},null,null,{"$f":"F8*G8","v":0}]
[null,null,null,"紙管","",null,null,0]
[null,null,"木くず","草・木","",null,null,0]
[null,null,null,"おがくず","",null,null,0]
[null,null,null,"木片","",null,null,0]
[null,null,null,"ベニア・合板・化粧版","",null,null,0]
[null,null,null,"集成材・ボード","",null,null,0]
[null,null,"繊維くず","木綿","",null,null,0]
[null,null,null,"羊毛","",null,null,0]
[null,null,"その他","一般雑芥","",null,null,0]
[null,null,null,"廃油(動植物系)","",null,null,0]
[null,null,null,"その他","",null,null,0]
[null,null,null,null,null,null,null,"①",{"$f":"SUM(H7:J19)","v":0}]
[]
[null,"非バイオマス燃料","種類",null,"構成比","Ｃ．非バイオマス\n（原料）利用量","Ｄ．非バイオマス\n（原料）低位発熱量","非バイオマス\n（原料）発熱量"]
[null,null,null,null,"％",{"$f":"F6","v":"kg/h"},{"$f":"G6","v":"MJ/kg"},"MJ/h"]
[null,null,"廃プラスチック類","ポリエチレン（ＰＥ）",{"$f":"IFERROR(F24/SUM($F$7:$F$19,$F$24:$F$41)*100,\"\")","v":""},null,null,{"$f":"F24*G24","v":0}]
[null,null,null,"ポリプロピレン（ＰＰ）","",null,null,0]
[null,null,null,"ポリスチレン（ＰＳ）","",null,null,0]
[null,null,null,"発泡スチロール","",null,null,0]
[null,null,null,"ＦＲＰ樹脂","",null,null,0]
[null,null,null,"フェノール樹脂","",null,null,0]
[null,null,null,"熱可塑性樹脂","",null,null,0]
[null,null,null,"混合樹脂製品","",null,null,0]
[null,null,null,"ＰＥＴボトル","",null,null,0]
[null,null,null,"皮製品","",null,null,0]
[null,null,"ゴムくず","タイヤ","",null,null,0]
[null,null,null,"合成ゴム","",null,null,0]
[null,null,"繊維くず","ナイロン布","",null,null,0]
[null,null,null,"アクリル布","",null,null,0]
[null,null,null,"ビニロン布","",null,null,0]
[null,null,null,"ポリエステル布","",null,null,0]
[null,null,"その他","廃油（石油系）","",null,null,0]
[null,null,null,"その他","",null,null,0]
[null,null,null,null,null,null,null,"②",{"$f":"SUM(H24:J41)","v":0}]
[null,null,"構成比の合計",null,{"$f":"SUM(E7:E19,E24:E41)","v":0}]
[]
[]
[null,"バイオマス依存率＝",null,null,null,null,"×100＝ ①/（①+②）×100"]
[null,null,null,null,null,null,"＝",{"$f":"IF(I20=0,0,I20/(I20+I42)*100)","v":0},null,"％",null,null,"※バイオマス依存率60％以上"]
[]
[null,null,"・バイオマス排水、家畜糞尿、食品残渣等を原料にする場合は、バイオマス依存率を１００％とする。"]
[null,null,"・メタン発酵方式の場合は、発酵槽へ投じられるものをバイオマス原料とする。"]

{"sheet":"第4号.バイオマス発電設備の概要_５枚目","index":22,"n_rows":284,"n_cols":14,"rows_kept":284,"cut":false,"hidden":false,"merged":[[275,5,275,6],[277,5,277,6],[279,5,279,6],[268,1,268,2],[269,1,269,2],[270,1,270,2],[271,1,271,2],[272,1,272,2],[273,1,273,2],[262,1,262,2],[263,1,263,2],[264,1,264,2],[265,1,265,2],[266,1,266,2],[267,1,267,2],[257,1,258,2],[257,3,258,3],[257,4,257,9],[259,1,259,2],[260,1,260,2],[261,1,261,2],[249,3,249,5],[249,6,249,9],[250,3,250,5],[250,6,250,9],[251,3,251,5],[251,6,251,9],[245,3,245,5],[245,6,245,9],[246,3,246,5],[246,6,246,9],[248,3,248,5],[248,6,248,9],[241,3,241,5],[241,6,241,9],[243,3,243,5],[243,6,243,9],[244,3,244,5],[244,6,244,9],[238,3,238,5],[238,6,238,9],[239,3,239,5],[239,6,239,9],[240,3,240,5],[240,6,240,9],[232,3,232,5],[232,6,232,9],[233,3,233,5],[233,6,233,9],[234,3,234,5],[234,6,234,9],[228,3,228,5],[228,6,228,9],[229,3,229,5],[229,6,229,9],[231,3,231,5],[231,6,231,9],[224,3,224,5],[224,6,224,9],[226,3,226,5],[226,6,226,9],[227,3,227,5],[227,6,227,9],[221,3,221,5],[221,6,221,9],[222,3,222,5],[222,6,222,9],[223,3,223,5],[223,6,223,9],[215,3,215,5],[215,6,215,9],[216,3,216,5],[216,6,216,9],[217,3,217,5],[217,6,217,9],[211,3,211,5],[211,6,211,9],[212,3,212,5],[212,6,212,9],[214,3,214,5],[214,6,214,9],[207,3,207,5],[207,6,207,9],[209,3,209,5],[209,6,209,9],[210,3,210,5],[210,6,210,9],[204,3,204,5],[204,6,204,9],[205,3,205,5],[205,6,205,9],[206,3,206,5],[206,6,206,9],[188,3,188,5],[188,6,188,9],[189,3,189,5],[189,6,189,9],[190,3,190,5],[190,6,190,9],[184,3,184,5],[184,6,184,9],[185,3,185,5],[185,6,185,9],[187,3,187,5],[187,6,187,9],[180,3,180,5],[180,6,180,9],[182,3,182,5],[182,6,182,9],[183,3,183,5],[183,6,183,9],[177,3,177,5],[177,6,177,9],[178,3,178,5],[178,6,178,9],[179,3,179,5],[179,6,179,9],[171,3,171,5],[171,6,171,9],[172,3,172,5],[172,6,172,9],[173,3,173,5],[173,6,173,9],[167,3,167,5],[167,6,167,9],[168,3,168,5],[168,6,168,9],[170,3,170,5],[170,6,170,9],[163,3,163,5],[163,6,163,9],[165,3,165,5],[165,6,165,9],[166,3,166,5],[166,6,166,9],[160,3,160,5],[160,6,160,9],[161,3,161,5],[161,6,161,9],[162,3,162,5],[162,6,162,9],[154,3,154,5],[154,6,154,8],[155,3,155,5],[155,6,155,8],[156,3,156,5],[156,6,156,8],[146,13,147,15],[149,3,149,5],[149,6,149,8],[150,12,151,12],[153,3,153,5],[153,6,153,8],[120,3,120,5],[120,6,120,8],[121,3,121,5],[121,6,121,8],[145,3,145,4],[145,6,145,8],[117,3,117,5],[117,6,117,8],[118,3,118,5],[118,6,118,8],[119,3,119,5],[119,6,119,8],[113,3,113,5],[113,6,113,8],[114,3,114,5],[114,6,114,8],[116,3,116,5],[116,6,116,8],[110,3,110,5],[110,6,110,8],[111,3,111,5],[111,6,111,8],[112,3,112,5],[112,6,112,8],[106,3,106,5],[106,6,106,8],[107,3,107,5],[107,6,107,8],[109,3,109,5],[109,6,109,8],[103,3,103,5],[103,6,103,8],[104,3,104,5],[104,6,104,8],[105,3,105,5],[105,6,105,8],[97,3,97,5],[97,6,97,8],[98,3,98,5],[98,6,98,8],[102,3,102,5],[102,6,102,8],[94,3,94,5],[94,6,94,8],[95,3,95,5],[95,6,95,8],[96,3,96,5],[96,6,96,8],[90,3,90,5],[90,6,90,8],[91,3,91,5],[91,6,91,8],[93,3,93,5],[93,6,93,8],[87,3,87,5],[87,6,87,8],[88,3,88,5],[88,6,88,8],[89,3,89,5],[89,6,89,8],[83,3,83,5],[83,6,83,8],[84,3,84,5],[84,6,84,8],[86,3,86,5],[86,6,86,8],[80,3,80,5],[80,6,80,8],[81,3,81,5],[81,6,81,8],[82,3,82,5],[82,6,82,8],[74,3,74,5],[74,6,74,8],[75,3,75,5],[75,6,75,8],[79,3,79,5],[79,6,79,8],[71,3,71,5],[71,6,71,8],[72,3,72,5],[72,6,72,8],[73,3,73,5],[73,6,73,8],[67,3,67,5],[67,6,67,8],[68,3,68,5],[68,6,68,8],[70,3,70,5],[70,6,70,8],[64,3,64,5],[64,6,64,8],[65,3,65,5],[65,6,65,8],[66,3,66,5],[66,6,66,8],[60,3,60,5],[60,6,60,8],[61,3,61,5],[61,6,61,8],[63,3,63,5],[63,6,63,8],[57,3,57,5],[57,6,57,8],[58,3,58,5],[58,6,58,8],[59,3,59,5],[59,6,59,8],[51,3,51,5],[51,6,51,8],[52,3,52,5],[52,6,52,8],[56,3,56,5],[56,6,56,8],[48,3,48,5],[48,6,48,8],[49,3,49,5],[49,6,49,8],[50,3,50,5],[50,6,50,8],[44,3,44,5],[44,6,44,8],[45,3,45,5],[45,6,45,8],[47,3,47,5],[47,6,47,8],[41,3,41,5],[41,6,41,8],[42,3,42,5],[42,6,42,8],[43,3,43,5],[43,6,43,8],[37,3,37,5],[37,6,37,8],[38,3,38,5],[38,6,38,8],[40,3,40,5],[40,6,40,8],[34,3,34,5],[34,6,34,8],[35,3,35,5],[35,6,35,8],[36,3,36,5],[36,6,36,8],[28,3,28,5],[28,6,28,8],[29,3,29,5],[29,6,29,8],[33,3,33,5],[33,6,33,8],[19,3,19,5],[19,6,19,8],[25,3,25,5],[25,6,25,8],[26,3,26,5],[26,6,26,8],[13,3,13,5],[13,6,13,8],[14,3,14,5],[14,6,14,8],[18,3,18,5],[18,6,18,8],[5,2,5,4],[5,5,5,9],[7,3,7,4],[11,3,11,5],[11,6,11,8],[12,3,12,5],[12,6,12,8]]}
[null,"２．設備の概要（５枚目）"]
[null,"　※複数の型式を導入する場合は、それぞれの型式ごとにまとめること。"]
[]
[null,"（１）設備導入場所ごとの設備概要"]
[]
[null,null,"導入場所名称",null,null,{"$f":"'第4号.バイオマス発電'!E39","v":0}]
[]
[null,null,null,"発電総出力",null,null,{"$f":"IF(G37=\"\",0,ROUNDDOWN(SUM(G39,G46,G53),0))","v":0},"kW",null,null,null,null,"※発電出力10kW以上"]
[]
[]
[null,"（２）バイオマス発電設備"]
[null,null,null,"形態",null,null,null,null,null,null,null,null,"←プルダウンリストから選択してください"]
[null,null,null,"１日あたりの設備稼働時間",null,null,null,null,null,"ｈ/日"]
[null,null,null,"年間稼働日数",null,null,null,null,null,"日"]
[null,null,null,"年間稼働時間",null,null,{"$f":"IF(G13=\"\",\"\",ROUNDDOWN((G13*G14),2))","v":""},null,null,"ｈ/年"]
[]
[]
[null,"（３）バイオマス燃料"]
[null,null,null,"種類"]
[null,null,null,"バイオマス依存率（※）",null,null,{"$f":"別紙１_５枚目!$H$47","v":0},null,null,"％",null,null,"←別紙４を作成すると自動計算されます"]
[null,null,null,"※算定方法は、別紙3のとおり。",null,null,null,null,null,null,null,null,"※バイオマス依存率60％以上"]
[]
[]
[null,"（４）助成燃料等　（※使用する場合のみ記入）"]
[null,null,null,"スタートアップの場合"]
[null,null,null,"使用量",null,null,null,null,null,"ｔ/回"]
[null,null,null,"使用頻度",null,null,null,null,null,"回/年"]
[null,null,null,"その他"]
[null,null,null,"使用量",null,null,null,null,null,"ｔ/回"]
[null,null,null,"使用頻度",null,null,null,null,null,"回/年"]
[]
[]
[null,"（５）発電機"]
[null,null,"①","製造者名（メーカー名）"]
[null,null,null,"型式名"]
[null,null,null,"発電方式",null,null,null,null,null,null,null,null,"←プルダウンリストから選択してください"]
[null,null,null,"１台あたりの定格出力",null,null,null,null,null,"kW"]
[null,null,null,"台数",null,null,null,null,null,"台"]
[null,null,null,"定格出力合計",null,null,{"$f":"IF(G37=\"\",\"\",ROUNDDOWN(G37*G38,1))","v":""},null,null,"kW"]
[]
[null,null,"②","製造者名（メーカー名）"]
[null,null,null,"型式名"]
[null,null,null,"発電方式",null,null,null,null,null,null,null,null,"←プルダウンリストから選択してください"]
[null,null,null,"１台あたりの定格出力",null,null,null,null,null,"kW"]
[null,null,null,"台数",null,null,null,null,null,"台"]
[null,null,null,"定格出力合計",null,null,{"$f":"IF(G44=\"\",\"\",ROUNDDOWN(G44*G45,1))","v":""},null,null,"kW"]
[]
[null,null,"③","製造者名（メーカー名）"]
[null,null,null,"型式名"]
[null,null,null,"発電方式",null,null,null,null,null,null,null,null,"←プルダウンリストから選択してください"]
[null,null,null,"１台あたりの定格出力",null,null,null,null,null,"kW"]
[null,null,null,"台数",null,null,null,null,null,"台"]
[null,null,null,"定格出力合計",null,null,{"$f":"IF(G51=\"\",\"\",ROUNDDOWN(G51*G52,1))","v":""},null,null,"kW"]
[]
[]
[null,"（６）バイオマスボイラ-"]
[null,null,"①","製造者名（メーカー名）"]
[null,null,null,"型式名"]
[null,null,null,"機器の種類"]
[null,null,null,"１台あたりの能力",null,null,null,null,null,"kW"]
[null,null,null,"台数",null,null,null,null,null,"台"]
[null,null,null,"能力合計",null,null,{"$f":"IF(G60=\"\",\"\",ROUNDDOWN(G60*G61,2))","v":""},null,null,"kW"]
[]
[null,null,"②","製造者名（メーカー名）"]
[null,null,null,"型式名"]
[null,null,null,"機器の種類"]
[null,null,null,"１台あたりの能力",null,null,null,null,null,"kW"]
[null,null,null,"台数",null,null,null,null,null,"台"]
[null,null,null,"能力合計",null,null,{"$f":"IF(G67=\"\",\"\",ROUNDDOWN(G67*G68,2))","v":""},null,null,"kW"]
[]
[null,null,"③","製造者名（メーカー名）"]
[null,null,null,"型式名"]
[null,null,null,"機器の種類"]
[null,null,null,"１台あたりの能力",null,null,null,null,null,"kW"]
[null,null,null,"台数",null,null,null,null,null,"台"]
[null,null,null,"能力合計",null,null,{"$f":"IF(G74=\"\",\"\",ROUNDDOWN(G74*G75,2))","v":""},null,null,"kW"]
[]
[]
[null,"（７）バイオマス受入・供給設備　（※設置する場合のみ記入）"]
[null,null,"①","製造者名（メーカー名）"]
[null,null,null,"型式名"]
[null,null,null,"機器の種類"]
[null,null,null,"１基あたりの容量",null,null,null,null,null,"ｍ3"]
[null,null,null,"台数",null,null,null,null,null,"基"]
[null,null,null,"容量合計",null,null,{"$f":"IF(G83=\"\",\"\",ROUNDDOWN(G83*G84,2))","v":""},null,null,"ｍ3"]
[]
[null,null,"②","製造者名（メーカー名）"]
[null,null,null,"型式名"]
[null,null,null,"機器の種類"]
[null,null,null,"１基あたりの容量",null,null,null,null,null,"ｍ3"]
[null,null,null,"台数",null,null,null,null,null,"基"]
[null,null,null,"容量合計",null,null,{"$f":"IF(G90=\"\",\"\",ROUNDDOWN(G90*G91,2))","v":""},null,null,"ｍ3"]
[]
[null,null,"③","製造者名（メーカー名）"]
[null,null,null,"型式名"]
[null,null,null,"機器の種類"]
[null,null,null,"１基あたりの容量",null,null,null,null,null,"ｍ3"]
[null,null,null,"台数",null,null,null,null,null,"基"]
[null,null,null,"容量合計",null,null,{"$f":"IF(G97=\"\",\"\",ROUNDDOWN(G97*G98,2))","v":""},null,null,"ｍ3"]
[]
[]
[null,"（８）冷却塔　（※設置する場合のみ記入）"]
[null,null,"①","製造者名（メーカー名）"]
[null,null,null,"型式名"]
[null,null,null,"機器の種類"]
[null,null,null,"１台あたりの能力",null,null,null,null,null,"kW"]
[null,null,null,"台数",null,null,null,null,null,"台"]
[null,null,null,"能力合計",null,null,{"$f":"IF(G106=\"\",\"\",ROUNDDOWN(G106*G107,2))","v":""},null,null,"kW"]
[]
[null,null,"②","製造者名（メーカー名）"]
[null,null,null,"型式名"]
[null,null,null,"機器の種類"]
[null,null,null,"１台あたりの能力",null,null,null,null,null,"kW"]
[null,null,null,"台数",null,null,null,null,null,"台"]
[null,null,null,"能力合計",null,null,{"$f":"IF(G113=\"\",\"\",ROUNDDOWN(G113*G114,2))","v":""},null,null,"kW"]
[]
[null,null,"③","製造者名（メーカー名）"]
[null,null,null,"型式名"]
[null,null,null,"機器の種類"]
[null,null,null,"１台あたりの能力",null,null,null,null,null,"kW"]
[null,null,null,"台数",null,null,null,null,null,"台"]
[null,null,null,"能力合計",null,null,{"$f":"IF(G120=\"\",\"\",ROUNDDOWN(G120*G121,2))","v":""},null,null,"kW"]
[]
[]
[null,null,"［添付資料］"]
[null,null,"・","主要設備のカタログ、パンフレット等",null,null,"（添付資料７）"]
[null,null,"・","システム系統図",null,null,"（添付資料８）"]
[null,null,"・","単線結線図",null,null,"（添付資料９）"]
[null,null,"・","機器配置図",null,null,"（添付資料10）"]
[null,null,"・","バイオマスの調達に係る資料",null,null,"（添付資料14）"]
[null,null,"・","灰の処分に係る資料",null,null,"（添付資料15）"]
[null,null,"・","低位発熱量を証明する資料",null,null,"（添付資料16）"]
[]
[]
[]
[]
[]
[]
[]
[]
[]
[]
[]
[null,"※バイオマス燃料製造を実施する場合のみ"]
[null,"（10）バイオマス燃料製造方式"]
[null,null,null,"形態　　：",null,null,null,null,null,null,null,null,"←プルダウンリストから選択してください"]
[null,null,null,null,null,null,null,null,null,null,null,null,null,"１．メタン発酵方式"]
[]
[null,"（11）製造時のバイオマス依存率",null,null,null,null,null,null,null,null,null,null,null,"　・ガス製造量：100 N㎥／日 以上"]
[null,null,null,"バイオマス依存率",null,null,{"$f":"'別紙１ (2)_５枚目'!$H$47","v":0},null,null,"％",null,null,"←別紙４を作成すると自動計算される","　・低位発熱量：18.84 MJ／N㎥（4,500kcal／N ㎥）以上"]
[null,null,null,null,null,null,null,null,null,null,null,null,"※バイオマス依存率60％以上"]
[]
[null,"（12）製造するバイオマス燃料",null,null,null,null,null,null,null,null,null,null,null,"２．メタン発酵方式以外"]
[null,null,null,"名称",null,null,null,null,null,null,null,null,null,"　・製造量：固形化 150kg／日 以上"]
[null,null,null,"形態",null,null,null,null,null,null,null,null,"←プルダウンリストから選択してください","　　　　　　　液 化 100kg／日 以上"]
[null,null,null,"製造量",null,null,null,null,null,{"$f":"IF(G155<>\"気体\",\"kg/日\",\"N㎥/日\")","v":"kg/日"},null,null,null,"　　　　　　　ガス化 450N㎥／日 以上"]
[null,null,null,"低位発熱量",null,null,null,null,null,{"$f":"IF(G155<>\"気体\",\"MJ/kg\",\"MJ/N㎥\")","v":"MJ/kg"},null,null,null,"（ただし、離島及びへき地は、上記要件を除く。）"]
[]
[]
[null,"（13）バイオマス燃料製造設備"]
[null,null,"①","製造者名（メーカー名）"]
[null,null,null,"型式名"]
[null,null,null,"機器の種類"]
[null,null,null,"能力・容量"]
[]
[null,null,"②","製造者名（メーカー名）"]
[null,null,null,"型式名"]
[null,null,null,"機器の種類"]
[null,null,null,"能力・容量"]
[]
[null,null,"③","製造者名（メーカー名）"]
[null,null,null,"型式名"]
[null,null,null,"機器の種類"]
[null,null,null,"能力・容量"]
[]
[]
[null,"（14）バイオマス原料受入・供給設備"]
[null,null,"①","製造者名（メーカー名）"]
[null,null,null,"型式名"]
[null,null,null,"機器の種類"]
[null,null,null,"能力・容量"]
[]
[null,null,"②","製造者名（メーカー名）"]
[null,null,null,"型式名"]
[null,null,null,"機器の種類"]
[null,null,null,"能力・容量"]
[]
[null,null,"③","製造者名（メーカー名）"]
[null,null,null,"型式名"]
[null,null,null,"機器の種類"]
[null,null,null,"能力・容量"]
[]
[]
[]
[]
[]
[]
[]
[]
[]
[]
[]
[]
[null,"（15）バイオマス燃料貯蔵設備"]
[null,null,"①","製造者名（メーカー名）"]
[null,null,null,"型式名"]
[null,null,null,"機器の種類"]
[null,null,null,"能力・容量"]
[]
[null,null,"②","製造者名（メーカー名）"]
[null,null,null,"型式名"]
[null,null,null,"機器の種類"]
[null,null,null,"能力・容量"]
[]
[null,null,"③","製造者名（メーカー名）"]
[null,null,null,"型式名"]
[null,null,null,"機器の種類"]
[null,null,null,"能力・容量"]
[]
[]
[null,"（16）前処理設備"]
[null,null,"①","製造者名（メーカー名）"]
[null,null,null,"型式名"]
[null,null,null,"機器の種類"]
[null,null,null,"能力・容量"]
[]
[null,null,"②","製造者名（メーカー名）"]
[null,null,null,"型式名"]
[null,null,null,"機器の種類"]
[null,null,null,"能力・容量"]
[]
[null,null,"③","製造者名（メーカー名）"]
[null,null,null,"型式名"]
[null,null,null,"機器の種類"]
[null,null,null,"能力・容量"]
[]
[]
[null,"（17）後処理設備"]
[null,null,"①","製造者名（メーカー名）"]
[null,null,null,"型式名"]
[null,null,null,"機器の種類"]
[null,null,null,"能力・容量"]
[]
[null,null,"②","製造者名（メーカー名）"]
[null,null,null,"型式名"]
[null,null,null,"機器の種類"]
[null,null,null,"能力・容量"]
[]
[null,null,"③","製造者名（メーカー名）"]
[null,null,null,"型式名"]
[null,null,null,"機器の種類"]
[null,null,null,"能力・容量"]
[]
[]
[null,"※バイオマス燃料製造を実施する場合のみ"]
[null,"・利用計画及び生産計画"]
[null,null,null,null,null,null,null,"（単位：",{"$f":"IF(G169<>\"気体\",\"kg\",\"N㎥\")","v":"kg"},"/年）"]
[null,"年次",null,"年間生産量","バイオマス燃料年間利用量"]
[null,null,null,null,null,null,null,null,null,"合計"]
[null,"1年目",null,null,null,null,null,null,null,{"$f":"SUM(E260:I260)","v":0}]
[null,"2年目",null,null,null,null,null,null,null,0]
[null,"3年目",null,null,null,null,null,null,null,0]
[null,"4年目",null,null,null,null,null,null,null,0]
[null,"5年目",null,null,null,null,null,null,null,0]
[null,"6年目",null,null,null,null,null,null,null,0]
[null,"7年目",null,null,null,null,null,null,null,0]
[null,"8年目",null,null,null,null,null,null,null,0]
[null,"9年目",null,null,null,null,null,null,null,0]
[null,"10年目",null,null,null,null,null,null,null,0]
[null,"11年目",null,null,null,null,null,null,null,0]
[null,"12年目",null,null,null,null,null,null,null,0]
[null,"13年目",null,null,null,null,null,null,null,0]
[null,"14年目",null,null,null,null,null,null,null,0]
[null,"15年目",null,null,null,null,null,null,null,0]
[]
[null,null,"年間最大生産量",null,null,{"$f":"MAX(D260:D274)","v":0}]
[]
[null,null,"年間最大利用量",null,null,{"$f":"MAX(J260:J274)","v":0}]
[]
[null,null,"設備利用率",null,null,{"$f":"IF(D260=\"\",\"\",F278/F276*100)","v":""},null,"％"]
[]
[null,"［添付資料］"]
[null,null,"・バイオマス燃料利用計画",null,null,null,null,"（添付資料17）"]
[null,null,"・バイオマス燃料製造計画",null,null,null,null,"（添付資料18）"]

{"sheet":"別紙１_５枚目","index":23,"n_rows":49,"n_cols":13,"rows_kept":49,"cut":false,"hidden":false,"merged":[[46,7,46,8],[35,2,38,2],[35,7,35,9],[36,7,36,9],[37,7,37,9],[38,7,38,9],[39,2,40,2],[39,7,39,9],[40,7,40,9],[41,7,42,7],[41,8,42,9],[42,2,42,3],[45,1,45,3],[45,6,45,9],[21,1,40,1],[23,7,23,9],[26,7,26,9],[27,7,27,9],[29,7,29,9],[30,7,30,9],[31,7,31,9],[32,7,32,9],[33,2,34,2],[33,7,33,9],[34,7,34,9],[12,7,12,9],[13,7,13,9],[21,2,22,3],[21,7,21,9],[22,7,22,9],[23,2,32,2],[28,7,28,9],[16,2,18,2],[16,7,16,9],[17,7,17,9],[18,7,18,9],[19,8,19,9],[24,7,24,9],[25,7,25,9],[14,2,15,2],[14,7,14,9],[15,7,15,9],[2,1,2,9],[4,1,18,1],[4,2,5,3],[4,7,4,9],[5,7,5,9],[6,2,8,2],[6,7,6,9],[7,7,7,9],[8,7,8,9],[9,2,13,2],[9,7,9,9],[10,7,10,9],[11,7,11,9]]}
[null,"第４号様式：別紙１（１）（５枚目）"]
[]
[null,"バイオマス依存率計算書（バイオマス発電）"]
[]
[null,"バイオマス燃料","種類",null,"構成比","Ａ．バイオマス\n（燃料）利用量","Ｂ．バイオマス\n（燃料）低位発熱量","バイオマス\n（燃料）発熱量"]
[null,null,null,null,"％","kg/h",{"$f":"IF(F6=\"kg/h\",\"MJ/kg\",\"MJ/N㎥\")","v":"MJ/kg"},"MJ/h",null,null,null,null,"←利用量の単位は、プルダウンリストから選択してください"]
[null,null,"紙くず","紙類",{"$f":"IFERROR(F7/SUM($F$7:$F$19,$F$24:$F$41)*100,\"\")","v":""},null,null,{"$f":"F7*G7","v":0}]
[null,null,null,"新聞紙",{"$f":"IFERROR(F8/SUM($F$7:$F$19,$F$24:$F$41)*100,\"\")","v":""},null,null,{"$f":"F8*G8","v":0}]
[null,null,null,"紙管","",null,null,0]
[null,null,"木くず","草・木","",null,null,0]
[null,null,null,"おがくず",{"$f":"IFERROR(F11/SUM($F$7:$F$19,$F$24:$F$41)*100,\"\")","v":""},null,null,0]
[null,null,null,"木片","",null,null,0]
[null,null,null,"ベニア・合板・化粧版","",null,null,0]
[null,null,null,"集成材・ボード","",null,null,0]
[null,null,"繊維くず","木綿","",null,null,0]
[null,null,null,"羊毛","",null,null,0]
[null,null,"その他","一般雑芥","",null,null,0]
[null,null,null,"廃油(動植物系)","",null,null,0]
[null,null,null,"その他","",null,null,0]
[null,null,null,null,null,null,null,"①",{"$f":"SUM(H7:J19)","v":0}]
[]
[null,"非バイオマス燃料","種類",null,"構成比","Ｃ．非バイオマス\n（燃料）利用量","Ｄ．非バイオマス\n（燃料）低位発熱量","非バイオマス\n（燃料）発熱量"]
[null,null,null,null,"％",{"$f":"F6","v":"kg/h"},{"$f":"G6","v":"MJ/kg"},"MJ/h"]
[null,null,"廃プラスチック類","ポリエチレン（ＰＥ）",{"$f":"IFERROR(F24/SUM($F$7:$F$19,$F$24:$F$41)*100,\"\")","v":""},null,null,{"$f":"F24*G24","v":0}]
[null,null,null,"ポリプロピレン（ＰＰ）",{"$f":"IFERROR(F25/SUM($F$7:$F$19,$F$24:$F$41)*100,\"\")","v":""},null,null,0]
[null,null,null,"ポリスチレン（ＰＳ）",{"$f":"IFERROR(F26/SUM($F$7:$F$19,$F$24:$F$41)*100,\"\")","v":""},null,null,{"$f":"F26*G26","v":0}]
[null,null,null,"発泡スチロール","",null,null,0]
[null,null,null,"ＦＲＰ樹脂","",null,null,0]
[null,null,null,"フェノール樹脂","",null,null,0]
[null,null,null,"熱可塑性樹脂","",null,null,0]
[null,null,null,"混合樹脂製品","",null,null,0]
[null,null,null,"ＰＥＴボトル","",null,null,0]
[null,null,null,"皮製品","",null,null,0]
[null,null,"ゴムくず","タイヤ","",null,null,0]
[null,null,null,"合成ゴム","",null,null,0]
[null,null,"繊維くず","ナイロン布","",null,null,0]
[null,null,null,"アクリル布","",null,null,0]
[null,null,null,"ビニロン布","",null,null,0]
[null,null,null,"ポリエステル布","",null,null,0]
[null,null,"その他","廃油（石油系）","",null,null,0]
[null,null,null,"その他","",null,null,0]
[null,null,null,null,null,null,null,"②",{"$f":"SUM(H24:J41)","v":0}]
[null,null,"構成比の合計",null,{"$f":"SUM(E7:E19,E24:E41)","v":0}]
[]
[]
[null,"バイオマス依存率＝",null,null,null,null,"×100＝ ①/（①+②）×100"]
[null,null,null,null,null,null,"＝",{"$f":"IF(I20=0,0,I20/(I20+I42)*100)","v":0},null,"％",null,null,"※バイオマス依存率60％以上"]
[]
[null,null,"・バイオマス排水、家畜糞尿、食品残渣等を原料にする場合は、バイオマス依存率を１００％とする。"]

{"sheet":"別紙１ (2)_５枚目","index":24,"n_rows":50,"n_cols":13,"rows_kept":50,"cut":false,"hidden":false,"merged":[[46,7,46,8],[35,2,38,2],[35,7,35,9],[36,7,36,9],[37,7,37,9],[38,7,38,9],[39,2,40,2],[39,7,39,9],[40,7,40,9],[41,7,42,7],[41,8,42,9],[42,2,42,3],[45,1,45,3],[45,6,45,9],[21,1,40,1],[23,7,23,9],[26,7,26,9],[27,7,27,9],[29,7,29,9],[30,7,30,9],[31,7,31,9],[32,7,32,9],[33,2,34,2],[33,7,33,9],[34,7,34,9],[12,7,12,9],[13,7,13,9],[21,2,22,3],[21,7,21,9],[22,7,22,9],[23,2,32,2],[28,7,28,9],[16,2,18,2],[16,7,16,9],[17,7,17,9],[18,7,18,9],[19,8,19,9],[24,7,24,9],[25,7,25,9],[14,2,15,2],[14,7,14,9],[15,7,15,9],[2,1,2,9],[4,1,18,1],[4,2,5,3],[4,7,4,9],[5,7,5,9],[6,2,8,2],[6,7,6,9],[7,7,7,9],[8,7,8,9],[9,2,13,2],[9,7,9,9],[10,7,10,9],[11,7,11,9]]}
[null,"第４号様式：別紙１（２）（５枚目）"]
[]
[null,"バイオマス依存率計算書（バイオマス燃料製造）"]
[]
[null,"バイオマス燃料","種類",null,"構成比","Ａ．バイオマス\n（原料）利用量","Ｂ．バイオマス\n（原料）低位発熱量","バイオマス\n（原料）発熱量"]
[null,null,null,null,"％","kg/h",{"$f":"IF(F6=\"kg/h\",\"MJ/kg\",\"MJ/N㎥\")","v":"MJ/kg"},"MJ/h",null,null,null,null,"←利用量の単位は、プルダウンリストから選択してください"]
[null,null,"紙くず","紙類",{"$f":"IFERROR(F7/SUM($F$7:$F$19,$F$24:$F$41)*100,\"\")","v":""},null,null,{"$f":"F7*G7","v":0}]
[null,null,null,"新聞紙",{"$f":"IFERROR(F8/SUM($F$7:$F$19,$F$24:$F$41)*100,\"\")","v":""},null,null,{"$f":"F8*G8","v":0}]
[null,null,null,"紙管","",null,null,0]
[null,null,"木くず","草・木","",null,null,0]
[null,null,null,"おがくず","",null,null,0]
[null,null,null,"木片","",null,null,0]
[null,null,null,"ベニア・合板・化粧版","",null,null,0]
[null,null,null,"集成材・ボード","",null,null,0]
[null,null,"繊維くず","木綿","",null,null,0]
[null,null,null,"羊毛","",null,null,0]
[null,null,"その他","一般雑芥","",null,null,0]
[null,null,null,"廃油(動植物系)","",null,null,0]
[null,null,null,"その他","",null,null,0]
[null,null,null,null,null,null,null,"①",{"$f":"SUM(H7:J19)","v":0}]
[]
[null,"非バイオマス燃料","種類",null,"構成比","Ｃ．非バイオマス\n（原料）利用量","Ｄ．非バイオマス\n（原料）低位発熱量","非バイオマス\n（原料）発熱量"]
[null,null,null,null,"％",{"$f":"F6","v":"kg/h"},{"$f":"G6","v":"MJ/kg"},"MJ/h"]
[null,null,"廃プラスチック類","ポリエチレン（ＰＥ）",{"$f":"IFERROR(F24/SUM($F$7:$F$19,$F$24:$F$41)*100,\"\")","v":""},null,null,{"$f":"F24*G24","v":0}]
[null,null,null,"ポリプロピレン（ＰＰ）","",null,null,0]
[null,null,null,"ポリスチレン（ＰＳ）","",null,null,0]
[null,null,null,"発泡スチロール","",null,null,0]
[null,null,null,"ＦＲＰ樹脂","",null,null,0]
[null,null,null,"フェノール樹脂","",null,null,0]
[null,null,null,"熱可塑性樹脂","",null,null,0]
[null,null,null,"混合樹脂製品","",null,null,0]
[null,null,null,"ＰＥＴボトル","",null,null,0]
[null,null,null,"皮製品","",null,null,0]
[null,null,"ゴムくず","タイヤ","",null,null,0]
[null,null,null,"合成ゴム","",null,null,0]
[null,null,"繊維くず","ナイロン布","",null,null,0]
[null,null,null,"アクリル布","",null,null,0]
[null,null,null,"ビニロン布","",null,null,0]
[null,null,null,"ポリエステル布","",null,null,0]
[null,null,"その他","廃油（石油系）","",null,null,0]
[null,null,null,"その他","",null,null,0]
[null,null,null,null,null,null,null,"②",{"$f":"SUM(H24:J41)","v":0}]
[null,null,"構成比の合計",null,{"$f":"SUM(E7:E19,E24:E41)","v":0}]
[]
[]
[null,"バイオマス依存率＝",null,null,null,null,"×100＝ ①/（①+②）×100"]
[null,null,null,null,null,null,"＝",{"$f":"IF(I20=0,0,I20/(I20+I42)*100)","v":0},null,"％",null,null,"※バイオマス依存率60％以上"]
[]
[null,null,"・バイオマス排水、家畜糞尿、食品残渣等を原料にする場合は、バイオマス依存率を１００％とする。"]
[null,null,"・メタン発酵方式の場合は、発酵槽へ投じられるものをバイオマス原料とする。"]

{"sheet":"第4号.バイオマス発電_導入効果","index":25,"n_rows":107,"n_cols":13,"rows_kept":107,"cut":false,"hidden":false,"merged":[[108,12,108,16],[109,7,109,8],[97,2,97,3],[98,2,98,3],[99,2,101,3],[103,2,103,3],[107,2,107,3],[108,1,108,9],[93,2,95,3],[67,2,67,3],[68,2,70,3],[74,2,74,3],[75,2,77,3],[80,2,80,3],[81,2,83,3],[85,2,85,3],[86,2,86,3],[87,2,89,3],[91,2,91,3],[92,2,92,3],[62,2,64,3],[31,2,31,3],[32,2,34,3],[37,2,37,3],[38,2,40,3],[43,2,43,3],[44,2,46,3],[49,2,49,3],[50,2,52,3],[55,2,55,3],[56,2,58,3],[61,2,61,3],[26,2,28,3],[2,3,2,5],[2,6,2,7],[4,3,4,5],[4,6,4,7],[6,3,6,5],[6,6,6,7],[13,2,13,3],[14,2,16,3],[19,2,19,3],[20,2,22,3],[25,2,25,3]]}
[null,"３．導入効果"]
[]
[null,null,null,"・需要先の年間想定電力消費量(A)",null,null,{"$f":"IF(E15=\"\",\"\",(J18+J24+J30+J36+J42+J48+J54+J60+J66+J72))","v":""},null,"kWh/年"]
[]
[null,null,null,"・年間想定発電電力量(B)（事業合計）",null,null,{"$f":"IF(E76=\"\",\"\",SUM(J79,J85,J91,J97,J103))","v":""},null,"kWh/年"]
[]
[null,null,null,"・差 （A－B)",null,null,{"$f":"IF(E15=\"\",\"\",G3-G5)","v":""},null,"kWh/年"]
[]
[null,"　「需要先の年間想定電力消費量」に対する「年間想定発電電力量」の比率"]
[null,null,null,null,null,null,{"$f":"IF(G5=\"\",\"\",ROUND(G5/G3*100,2))","v":""},"%"]
[null,null,null,null,null,{"$f":"IF(G10=\"\",\"\",IF(G10>=100,\"申請要件を満たさないため申請不可\",\"  \"))","v":""}]
[]
[null,"（１）需要先ごとの消費電力量",null,null,null,null,null,null,null,"（kWh）"]
[null,null,"消費電力量（A）",null,"４月","５月","６月","７月","８月","９月"]
[null,null,{"$f":"IF('第4号.バイオマス発電'!E46=\"\",\"\",'第4号.バイオマス発電'!E46)","v":""}]
[null,null,null,null,"１０月","１１月","１２月","１月","２月","３月"]
[]
[null,null,null,null,null,null,null,"消費電力量小計(kWh)",null,{"$f":"IF(E15=\"\",\"0\",SUM(E15:J15,E17:J17))","v":"0"}]
[]
[null,null,"消費電力量（A）",null,"４月","５月","６月","７月","８月","９月"]
[null,null,{"$f":"IF('第4号.バイオマス発電'!E52=\"\",\"\",'第4号.バイオマス発電'!E52)","v":""}]
[null,null,null,null,"１０月","１１月","１２月","１月","２月","３月"]
[]
[null,null,null,null,null,null,null,"消費電力量小計(kWh)",null,{"$f":"IF(E21=\"\",\"0\",SUM(E21:J21,E23:J23))","v":"0"}]
[]
[null,null,"消費電力量（A）",null,"４月","５月","６月","７月","８月","９月"]
[null,null,{"$f":"IF('第4号.バイオマス発電'!E58=\"\",\"\",'第4号.バイオマス発電'!E58)","v":""}]
[null,null,null,null,"１０月","１１月","１２月","１月","２月","３月"]
[]
[null,null,null,null,null,null,null,"消費電力量小計(kWh)",null,{"$f":"IF(E27=\"\",\"0\",SUM(E27:J27,E29:J29))","v":"0"}]
[]
[null,null,"消費電力量（A）",null,"４月","５月","６月","７月","８月","９月"]
[null,null,{"$f":"IF('第4号.バイオマス発電'!E64=\"\",\"\",'第4号.バイオマス発電'!E64)","v":""}]
[null,null,null,null,"１０月","１１月","１２月","１月","２月","３月"]
[]
[null,null,null,null,null,null,null,"消費電力量小計(kWh)",null,{"$f":"IF(E33=\"\",\"0\",SUM(E33:J33,E35:J35))","v":"0"}]
[]
[null,null,"消費電力量（A）",null,"４月","５月","６月","７月","８月","９月"]
[null,null,{"$f":"IF('第4号.バイオマス発電'!E70=\"\",\"\",'第4号.バイオマス発電'!E70)","v":""}]
[null,null,null,null,"１０月","１１月","１２月","１月","２月","３月"]
[]
[null,null,null,null,null,null,null,"消費電力量小計(kWh)",null,{"$f":"IF(E39=\"\",\"0\",SUM(E39:J39,E41:J41))","v":"0"}]
[]
[null,null,"消費電力量（A）",null,"４月","５月","６月","７月","８月","９月"]
[null,null,{"$f":"IF('第4号.バイオマス発電'!E76=\"\",\"\",'第4号.バイオマス発電'!E76)","v":""}]
[null,null,null,null,"１０月","１１月","１２月","１月","２月","３月"]
[]
[null,null,null,null,null,null,null,"消費電力量小計(kWh)",null,{"$f":"IF(E45=\"\",\"0\",SUM(E45:J45,E47:J47))","v":"0"}]
[]
[null,null,"消費電力量（A）",null,"４月","５月","６月","７月","８月","９月"]
[null,null,{"$f":"IF('第4号.バイオマス発電'!E82=\"\",\"\",'第4号.バイオマス発電'!E82)","v":""}]
[null,null,null,null,"１０月","１１月","１２月","１月","２月","３月"]
[]
[null,null,null,null,null,null,null,"消費電力量小計(kWh)",null,{"$f":"IF(E51=\"\",\"0\",SUM(E51:J51,E53:J53))","v":"0"}]
[]
[null,null,"消費電力量（A）",null,"４月","５月","６月","７月","８月","９月"]
[null,null,{"$f":"IF('第4号.バイオマス発電'!E88=\"\",\"\",'第4号.バイオマス発電'!E88)","v":""}]
[null,null,null,null,"１０月","１１月","１２月","１月","２月","３月"]
[]
[null,null,null,null,null,null,null,"消費電力量小計(kWh)",null,{"$f":"IF(E57=\"\",\"0\",SUM(E57:J57,E59:J59))","v":"0"}]
[]
[null,null,"消費電力量（A）",null,"４月","５月","６月","７月","８月","９月"]
[null,null,{"$f":"IF('第4号.バイオマス発電'!E94=\"\",\"\",'第4号.バイオマス発電'!E94)","v":""}]
[null,null,null,null,"１０月","１１月","１２月","１月","２月","３月"]
[]
[null,null,null,null,null,null,null,"消費電力量小計(kWh)",null,{"$f":"IF(E63=\"\",\"0\",SUM(E63:J63,E65:J65))","v":"0"}]
[]
[null,null,"消費電力量（A）",null,"４月","５月","６月","７月","８月","９月"]
[null,null,{"$f":"IF('第4号.バイオマス発電'!E100=\"\",\"\",'第4号.バイオマス発電'!E100)","v":""}]
[null,null,null,null,"１０月","１１月","１２月","１月","２月","３月"]
[]
[null,null,null,null,null,null,null,"消費電力量小計(kWh)",null,{"$f":"IF(E69=\"\",\"0\",SUM(E69:J69,E71:J71))","v":"0"}]
[]
[null,"（２）設備導入場所ごとの想定発電電力量（月別、年間の発電量）",null,null,null,null,null,null,null,"（kWh）"]
[null,null,"発電電力量（B）",null,"４月","５月","６月","７月","８月","９月",null,null,"発電電力量は試算をもとに記入してください"]
[null,null,{"$f":"IF('第4号.バイオマス発電'!E15=\"\",\"\",'第4号.バイオマス発電'!E15)","v":""}]
[null,null,null,null,"１０月","１１月","１２月","１月","２月","３月"]
[]
[null,null,null,null,null,null,null,"発電電力量小計(kWh)",null,{"$f":"IF(E76=\"\",\"0\",SUM(E76:J76,E78:J78))","v":"0"}]
[]
[null,null,"発電電力量（B）",null,"４月","５月","６月","７月","８月","９月"]
[null,null,{"$f":"IF('第4号.バイオマス発電'!E21=\"\",\"\",'第4号.バイオマス発電'!E21)","v":""}]
[null,null,null,null,"１０月","１１月","１２月","１月","２月","３月"]
[]
[null,null,null,null,null,null,null,"発電電力量小計(kWh)",null,{"$f":"IF(E82=\"\",\"0\",SUM(E82:J82,E84:J84))","v":"0"}]
[]
[null,null,"発電電力量（B）",null,"４月","５月","６月","７月","８月","９月"]
[null,null,{"$f":"IF('第4号.バイオマス発電'!E27=\"\",\"\",'第4号.バイオマス発電'!E27)","v":""}]
[null,null,null,null,"１０月","１１月","１２月","１月","２月","３月"]
[]
[null,null,null,null,null,null,null,"発電電力量小計(kWh)",null,{"$f":"IF(E88=\"\",\"0\",SUM(E88:J88,E90:J90))","v":"0"}]
[]
[null,null,"発電電力量（B）",null,"４月","５月","６月","７月","８月","９月"]
[null,null,{"$f":"IF('第4号.バイオマス発電'!E33=\"\",\"\",'第4号.バイオマス発電'!E33)","v":""}]
[null,null,null,null,"１０月","１１月","１２月","１月","２月","３月"]
[]
[null,null,null,null,null,null,null,"発電電力量小計(kWh)",null,{"$f":"IF(E94=\"\",\"0\",SUM(E94:J94,E96:J96))","v":"0"}]
[]
[null,null,"発電電力量（B）",null,"４月","５月","６月","７月","８月","９月"]
[null,null,{"$f":"IF('第4号.バイオマス発電'!E39=\"\",\"\",'第4号.バイオマス発電'!E39)","v":""}]
[null,null,null,null,"１０月","１１月","１２月","１月","２月","３月"]
[]
[null,null,null,null,null,null,null,"発電電力量小計(kWh)",null,{"$f":"IF(E100=\"\",\"0\",SUM(E100:J100,E102:J102))","v":"0"}]
[]
[null,null,"［添付資料］"]
[null,null,"・対象施設等で必要とされる電力の計算根拠",null,null,null,null,"（添付資料11）"]
[null,null,"・再エネ設備から供給される発電量の計算根拠",null,null,null,null,"（添付資料12）"]

{"sheet":"第4号.バイオマス発電_4ー10","index":26,"n_rows":213,"n_cols":17,"rows_kept":213,"cut":false,"hidden":false,"merged":[[167,3,167,4],[167,5,167,9],[169,5,169,9],[167,1,167,2],[47,2,47,9],[48,2,48,9],[50,1,60,9],[168,1,168,2],[168,3,168,4],[168,5,168,9],[169,1,169,2],[169,3,169,4],[73,2,73,9],[74,2,74,9],[75,2,75,9],[77,1,87,9],[212,1,212,3],[212,4,212,5],[212,6,212,7],[212,8,212,9],[170,1,170,2],[170,3,170,4],[170,5,170,9],[173,1,173,2],[173,3,173,4],[173,5,173,9],[171,3,171,4],[172,3,172,4],[205,1,209,9],[188,1,188,10],[198,1,202,9],[194,1,194,9],[12,5,12,9],[13,5,13,9],[15,1,26,9],[46,2,46,9],[1,7,1,8],[11,1,11,3],[11,4,11,9],[12,1,13,3],[33,1,33,3],[33,4,33,5],[149,1,158,9],[34,1,35,3],[34,4,35,5],[67,1,70,1],[67,2,70,9]]}
[]
[null,"４．事業費"]
[null,"（１）事業経費配分"]
[null,null,"共通様式１のとおり"]
[]
[null,"（２）助成金申請額"]
[null,null,"共通様式１のとおり"]
[]
[null,"５．電力供給方法の概要"]
[]
[null,"【電力供給方法の概要】",null,null,null,null,null,null,null,null,null,null,null,null,null,null,"形態①～形態⑨のいずれかを選択してください"]
[null,"形態の区分",null,null,"形態①～形態⑨のいずれかを選択してください",null,null,null,null,null,null,null,null,null,null,null,"形態①　発電事業者１者→小売電気事業者→需要家１者"]
[null,"小売電気事業者",null,null,"名称",null,null,null,null,null,null,null,null,null,null,null,"形態②　発電事業者１者→小売電気事業者→需要家複数者"]
[null,null,null,null,"住所",null,null,null,null,null,null,null,null,null,null,null,"形態③　発電事業者複数者→小売電気事業者→需要家１者"]
[null,"【概要】",null,null,null,null,null,null,null,null,null,null,null,null,null,null,"形態④　発電事業者複数者→小売電気事業者→需要家複数者"]
[null,null,null,null,null,null,null,null,null,null,null,null,null,null,null,null,"形態⑤　発電事業者１者→自己託送→需要家１者"]
[null,null,null,null,null,null,null,null,null,null,null,null,null,null,null,null,"形態⑥　発電事業者１者→自己託送→需要家複数者"]
[null,null,null,null,null,null,null,null,null,null,null,null,null,null,null,null,"形態⑦　発電事業者複数者→自己託送→需要家１者"]
[null,null,null,null,null,null,null,null,null,null,null,null,null,null,null,null,"形態⑧　発電事業者複数者→自己託送→需要家複数者"]
[null,null,null,null,null,null,null,null,null,null,null,null,null,null,null,null,"形態⑨　形態①～形態⑧のいずれにも該当しないもの"]
[]
[]
[]
[]
[]
[]
[]
[]
[null,"［添付資料］"]
[null,"・自己託送、小売電気事業者を介して供給することに係る申込書(写し)（添付資料20）"]
[]
[null,"６．発電事業者・電力需要家間の電力調達契約年数または事業継続年数"]
[]
[null,"項目",null,null,"年数"]
[]
[]
[]
[null,"［添付資料］"]
[null,"・電力購入契約書（写し）又は契約書案 （添付資料21）"]
[]
[null,"７．再エネ設置地域との関係構築"]
[]
[null,"（１）非常時における助成対象設備の利活用に係る協定"]
[]
[null,"協定締結先"]
[]
[null,"自治体等の名称"]
[null,"代表者 \n職・氏名"]
[null,"住所"]
[null,"【概要】"]
[]
[]
[]
[]
[]
[]
[]
[]
[]
[]
[]
[]
[null,"［添付資料］"]
[null,"・交付要綱第３条第２項第１号を満たすことが分かる資料 （添付資料23）"]
[]
[null,"（２）再エネ設置地域との関係構築 （ (１) を除くもの ）"]
[]
[null,"関係構築\n(ア）～(オ)",null,null,null,null,null,null,null,null,null,null,null,null,null,"（ア）助成対象設備から得られた電気を、本店所在地が再エネ設置地域に属する小売電気事業者に卸し、都内の特定の施設に供給する"]
[null,null,null,null,null,null,null,null,null,null,null,null,null,null,null,"（イ）助成対象設備設置に係る出資または融資を、本店所在地が再エネ設置地域に属する事業者または再エネ設置地域住民から受ける"]
[null,null,null,null,null,null,null,null,null,null,null,null,null,null,null,"（ウ）助成対象設備に係る施工または維持管理を再エネ設置地域に属する事業者に担わせる"]
[null,null,null,null,null,null,null,null,null,null,null,null,null,null,null,"（エ）助成対象設備から得られた電気の需給管理を再エネ設置地域に属する事業者に担わせる"]
[null,null,null,null,null,null,null,null,null,null,null,null,null,null,null,"（オ）その他公社が認める再エネ設置地域との関係構築を行う"]
[null,"再エネ設置地域事業者（又は小売電気事業者、住民）"]
[null,"名称"]
[null,"代表者名"]
[null,"住所"]
[null,"【概要】"]
[]
[]
[]
[]
[]
[]
[]
[]
[]
[]
[]
[]
[null,"［添付資料］"]
[null,"・交付要綱第３条第２項第２号ア～オいずれかを満たすことがわかる資料（添付資料24）"]
[]
[]
[]
[]
[]
[]
[]
[]
[]
[]
[]
[]
[]
[]
[null,"８．事業の実施体制"]
[]
[null,"（１）以下の事業関係者が記載された、実施体制図を記載、または添付してください"]
[]
[null,null,"(ア)申請代表者",null,null,null,"　　(ク)発電した電力の卸先小売電気事業者",null,null,null,null,null,"□←体制図へ記載した項目はチェックを付けてください。"]
[null,null,"(イ)経理担当者",null,null,null,"　　(ケ)発電した電力の需要先、所有代表者"]
[null,null,"(ウ)検収責任者",null,null,null,"　　(コ)助成対象事業への出資、もしくは融資者"]
[null,null,"(エ)事業実施担当者",null,null,null,"　　(サ)助成対象設備の施行事業者"]
[null,null,"(オ)共同申請者",null,null,null,"　　(シ)助成対象設備の維持管理事業者"]
[null,null,"(カ)助成対象設備から得られた電気の受給管理を担う事業者"]
[null,null,"(キ)非常時における助成対象設備の利活用に係る協定等を締結した自治体"]
[]
[]
[]
[]
[]
[]
[]
[]
[]
[]
[]
[]
[]
[]
[]
[]
[]
[]
[]
[]
[]
[]
[]
[]
[]
[]
[]
[]
[]
[]
[]
[]
[null,"（２）請負会社の選定方法"]
[]
[]
[]
[]
[]
[]
[]
[]
[]
[]
[null,"※選定に当たっては、見積書等による競争に付してください。"]
[]
[null,"９．実施事業に関する事項"]
[null,"（１）許認可・権利関係等事業実施の前提となる事項及び実施上問題となる事項"]
[null,"※　事業実施に当たって許認可（届出）、権利使用（又は取得）の必要なものについて、その取得状況等を"]
[null,"　記載すること。"]
[null,"※　実施上問題となる事項があれば、その内容と解決の見通しを記載すること。"]
[]
[null,"事　項",null,"事項の有無",null,"詳細"]
[null,"法規制に係る\n許認可",null,null,null,null,null,null,null,null,null,null,{"$f":"IF(D169=\"\",\"←【事項の有無】が選択されていません。必ず選択してください\",IF(E169=\" \",\"\",\"\"))","v":"←【事項の有無】が選択されていません。必ず選択してください"}]
[null,"地元調整",null,null,null,null,null,null,null,null,null,null,{"$f":"IF(D170=\"\",\"←【事項の有無】が選択されていません。必ず選択してください\",IF(E170=\" \",\"\",\"\"))","v":"←【事項の有無】が選択されていません。必ず選択してください"}]
[null,"系統連系協議",null,null,null,null,null,null,null,null,null,null,"←【事項の有無】が選択されていません。必ず選択してください"]
[null,"環境に関する調査等",null,null,null,null,null,null,null,null,null,null,"←【事項の有無】が選択されていません。必ず選択してください"]
[null,"用地確保",null,null,null,null,null,null,null,null,null,null,"←【事項の有無】が選択されていません。必ず選択してください"]
[null,"その他",null,null,null,null,null,null,null,null,null,null,"←【事項の有無】が選択されていません。必ず選択してください"]
[]
[null,"［添付資料］"]
[null,"・許認可,権利関係等事業実施の前提となる事項等がわかる資料 （添付資料26）"]
[null,"（２）「事業計画策定ガイドライン」遵守確認"]
[null,"【持続可能な事業実施に向けた方策】※それぞれにチェックを入れてください"]
[]
[null,null,"「事業計画策定ガイドライン（バイオマス発電）」等を遵守します。"]
[]
[null,null,"バイオマス発電設備の廃棄費用の積立について、計画に具体的に記載しています。"]
[]
[null,null,"事業計画作成の初期段階から地域住民と適切なコミュニケーションを図るとともに、"]
[null,null,"地域住民に十分配慮して事業を実施します。"]
[]
[null,"【計画の概要】"]
[]
[]
[null,"［添付資料］"]
[null,"・事業計画策定ガイドライン遵守確認資料 （添付資料27）"]
[]
[null,"（３）設備の保守計画"]
[]
[]
[null,"（４）本事業スキームの活用"]
[null,"今後の活用見通し"]
[]
[]
[]
[]
[]
[]
[null,"過去の活用事例"]
[]
[]
[]
[]
[]
[]
[null,"（５）余剰電力売電の有無"]
[null,"売電の有無",null,null,null,null,null,null,null,null,null,null,"←固定価格買取制度を活用する場合は助成対象外事業"]